BDBM50434329 CHEMBL2386554
SMILES: Cn1cc(Sc2ccc(Cl)cc2)c(n1)-c1ccc2ccc(nc2c1)C(N)=O
InChI Key: InChIKey=OYPLADYECBDMNJ-UHFFFAOYSA-N
Data: 2 IC50
Activity Spreadsheet -- Enzyme Inhibition Constant Data from BindingDB
Found 2 hits for monomerid = 50434329
Trg + Lig
Ki
nM
ΔG°
kcal/mole
IC50
nM
Kd
nM
EC50/IC50
nM
koff
s-1
kon
M-1s-1
pHTemp
°C
Fatty-acid amide hydrolase 1
(Homo sapiens (Human))
BDBM50434329
(CHEMBL2386554)
Show SMILES Cn1cc(Sc2ccc(Cl)cc2)c(n1)-c1ccc2ccc(nc2c1)C(N)=O
Show InChI InChI=1S/C20H15ClN4OS/c1-25-11-18(27-15-7-5-14(21)6-8-15)19(24-25)13-3-2-12-4-9-16(20(22)26)23-17(12)10-13/h2-11H,1H3,(H2,22,26)
n/an/a 0.5n/an/an/an/an/an/a
Merck Research Laboratories
Curated by ChEMBL
Assay Description
Inhibition of human FAAH expressed in CHO cell lysates assessed as arachidonyl-7-amino-4-methylcoumarin amide hydrolysis to 7-amino 4-methyl coumarin...
ACS Med Chem Lett 4: 509-13 (2013)
Article DOI: 10.1021/ml4000996
BindingDB Entry DOI: 10.7270/Q21R6RWJ
Fatty-acid amide hydrolase 1 (aa 30-579)
(Rattus norvegicus (rat))
BDBM50434329
(CHEMBL2386554)
Show SMILES Cn1cc(Sc2ccc(Cl)cc2)c(n1)-c1ccc2ccc(nc2c1)C(N)=O
Show InChI InChI=1S/C20H15ClN4OS/c1-25-11-18(27-15-7-5-14(21)6-8-15)19(24-25)13-3-2-12-4-9-16(20(22)26)23-17(12)10-13/h2-11H,1H3,(H2,22,26)
n/an/a 0.400n/an/an/an/an/an/a
Merck Research Laboratories
Curated by ChEMBL
Assay Description
Inhibition of rat FAAH expressed in CHO cell lysates assessed as arachidonyl-7-amino-4-methylcoumarin amide hydrolysis to 7-amino 4-methyl coumarin p...
ACS Med Chem Lett 4: 509-13 (2013)
Article DOI: 10.1021/ml4000996
BindingDB Entry DOI: 10.7270/Q21R6RWJ