BDBM50434350 CHEMBL2386750::US9446044, 67
SMILES: COC(=N)c1nc2ccc3ncnc(Nc4cccc(c4)C#N)c3c2s1
InChI Key: InChIKey=ZSZSXTFUWZNVBW-UHFFFAOYSA-N
Data: 4 IC50
Activity Spreadsheet -- Enzyme Inhibition Constant Data from BindingDB
Found 4 hits for monomerid = 50434350
Trg + Lig
Ki
nM
ΔG°
kcal/mole
IC50
nM
Kd
nM
EC50/IC50
nM
koff
s-1
kon
M-1s-1
pHTemp
°C
Dual specificity tyrosine-phosphorylation-regulated kinase 1A
(Homo sapiens (Human))
BDBM50434350
(CHEMBL2386750 | US9446044, 67)
Show SMILES COC(=N)c1nc2ccc3ncnc(Nc4cccc(c4)C#N)c3c2s1
Show InChI InChI=1S/C18H12N6OS/c1-25-16(20)18-24-13-6-5-12-14(15(13)26-18)17(22-9-21-12)23-11-4-2-3-10(7-11)8-19/h2-7,9,20H,1H3,(H,21,22,23)
Reactome pathway
US Patent
n/an/a 42.7n/an/an/an/a7.525
DIAXONHIT
US Patent
Assay Description
The DYRK1A and DYRK1B kinase assays to determine IC50 values were performed by Reaction Biology Corporation using HotSpot technology Worldwide websit...
US Patent US9446044 (2016)
BindingDB Entry DOI: 10.7270/Q2610Z7J
Dual specificity tyrosine-phosphorylation-regulated kinase 1B
(Homo sapiens (Human))
BDBM50434350
(CHEMBL2386750 | US9446044, 67)
Show SMILES COC(=N)c1nc2ccc3ncnc(Nc4cccc(c4)C#N)c3c2s1
Show InChI InChI=1S/C18H12N6OS/c1-25-16(20)18-24-13-6-5-12-14(15(13)26-18)17(22-9-21-12)23-11-4-2-3-10(7-11)8-19/h2-7,9,20H,1H3,(H,21,22,23)
n/an/a 72n/an/an/an/an/an/a
Dart Neuroscience LLC
Curated by ChEMBL
Assay Description
Inhibition of recombinant DYRK1B (unknown origin) after 120 mins in presence of [33P]-ATP
ACS Med Chem Lett 4: 502-3 (2013)
Article DOI: 10.1021/ml400137s
BindingDB Entry DOI: 10.7270/Q2NK3GDP
Dual specificity tyrosine-phosphorylation-regulated kinase 1A
(Homo sapiens (Human))
BDBM50434350
(CHEMBL2386750 | US9446044, 67)
Show SMILES COC(=N)c1nc2ccc3ncnc(Nc4cccc(c4)C#N)c3c2s1
Show InChI InChI=1S/C18H12N6OS/c1-25-16(20)18-24-13-6-5-12-14(15(13)26-18)17(22-9-21-12)23-11-4-2-3-10(7-11)8-19/h2-7,9,20H,1H3,(H,21,22,23)
Reactome pathway
n/an/a 43n/an/an/an/an/an/a
Dart Neuroscience LLC
Curated by ChEMBL
Assay Description
Inhibition of recombinant DYRK1A (unknown origin) after 120 mins in presence of [33P]-ATP
ACS Med Chem Lett 4: 502-3 (2013)
Article DOI: 10.1021/ml400137s
BindingDB Entry DOI: 10.7270/Q2NK3GDP
Dual specificity tyrosine-phosphorylation-regulated kinase 1B
(Homo sapiens (Human))
BDBM50434350
(CHEMBL2386750 | US9446044, 67)
Show SMILES COC(=N)c1nc2ccc3ncnc(Nc4cccc(c4)C#N)c3c2s1
Show InChI InChI=1S/C18H12N6OS/c1-25-16(20)18-24-13-6-5-12-14(15(13)26-18)17(22-9-21-12)23-11-4-2-3-10(7-11)8-19/h2-7,9,20H,1H3,(H,21,22,23)
US Patent
n/an/a 72.0n/an/an/an/a7.525
DIAXONHIT
US Patent
Assay Description
The DYRK1A and DYRK1B kinase assays to determine IC50 values were performed by Reaction Biology Corporation using HotSpot technology Worldwide websit...
US Patent US9446044 (2016)
BindingDB Entry DOI: 10.7270/Q2610Z7J