BDBM50434413 CHEMBL2387447
SMILES: CC[C@H](C[C@H](O)[C@@H](N)CN1CC(=O)N(CC1(C)C)c1ccccc1Cl)C(=O)NCC(C)(C)C
InChI Key: InChIKey=GLANVCJTCYFHJI-LMNJBCLMSA-N
Data: 2 IC50
Activity Spreadsheet -- Enzyme Inhibition Constant Data from BindingDB
Found 2 hits for monomerid = 50434413
Trg + Lig
Ki
nM
ΔG°
kcal/mole
IC50
nM
Kd
nM
EC50/IC50
nM
koff
s-1
kon
M-1s-1
pHTemp
°C
Renin
(Homo sapiens (Human))
BDBM50434413
(CHEMBL2387447)
Show SMILES CC[C@H](C[C@H](O)[C@@H](N)CN1CC(=O)N(CC1(C)C)c1ccccc1Cl)C(=O)NCC(C)(C)C |r|
Show InChI InChI=1S/C25H41ClN4O3/c1-7-17(23(33)28-15-24(2,3)4)12-21(31)19(27)13-29-14-22(32)30(16-25(29,5)6)20-11-9-8-10-18(20)26/h8-11,17,19,21,31H,7,12-16,27H2,1-6H3,(H,28,33)/t17-,19+,21+/m1/s1
Reactome pathway
n/an/a 0.800n/an/an/an/an/an/a
Daiichi Sankyo Co., Ltd
Curated by ChEMBL
Assay Description
Inhibition of human recombinant renin using Arg-Glu(EDANS)-Ile-His-Pro-Phe-His-Leu-Val-Ile-His-Thr-Lys (DABCYL)-Arg as substrate incubated for 10 min...
Bioorg Med Chem 21: 3175-96 (2013)
Article DOI: 10.1016/j.bmc.2013.03.022
BindingDB Entry DOI: 10.7270/Q2GT5PJK
Renin
(Macaca fascicularis)
BDBM50434413
(CHEMBL2387447)
Show SMILES CC[C@H](C[C@H](O)[C@@H](N)CN1CC(=O)N(CC1(C)C)c1ccccc1Cl)C(=O)NCC(C)(C)C |r|
Show InChI InChI=1S/C25H41ClN4O3/c1-7-17(23(33)28-15-24(2,3)4)12-21(31)19(27)13-29-14-22(32)30(16-25(29,5)6)20-11-9-8-10-18(20)26/h8-11,17,19,21,31H,7,12-16,27H2,1-6H3,(H,28,33)/t17-,19+,21+/m1/s1
n/an/a 2.30n/an/an/an/an/an/a
Daiichi Sankyo Co., Ltd
Curated by ChEMBL
Assay Description
Inhibition of renin in cynomolgus monkey plasma after 1 hr by RIA
Bioorg Med Chem 21: 3175-96 (2013)
Article DOI: 10.1016/j.bmc.2013.03.022
BindingDB Entry DOI: 10.7270/Q2GT5PJK