BDBM50434426 CHEMBL2387566
SMILES: CC(C)[C@H](C[C@H](O)[C@@H](N)CN1CC(=O)N(CC1(C)C)c1ccccc1Cl)C(=O)N[C@H]1C2CC3CC1C[C@](O)(C3)C2
InChI Key: InChIKey=ACQUOAYRAUXOAO-YORZAYTESA-N
Data: 2 IC50
Activity Spreadsheet -- Enzyme Inhibition Constant Data from BindingDB
Found 2 hits for monomerid = 50434426
Trg + Lig
Ki
nM
ΔG°
kcal/mole
IC50
nM
Kd
nM
EC50/IC50
nM
koff
s-1
kon
M-1s-1
pHTemp
°C
Renin
(Macaca fascicularis)
BDBM50434426
(CHEMBL2387566)
Show SMILES CC(C)[C@H](C[C@H](O)[C@@H](N)CN1CC(=O)N(CC1(C)C)c1ccccc1Cl)C(=O)N[C@H]1C2CC3CC1C[C@](O)(C3)C2 |r,wU:5.5,3.3,29.30,wD:36.39,7.7,TLB:28:29:39.35.36:33.32.31,28:29:31:39.36.38,37:36:29:33.32.31,THB:35:34:31:39.36.38,35:36:29.34.33:31,38:36:29:33.32.31,38:32:29:39.35.36,(39.25,-40.47,;37.92,-41.24,;36.58,-40.47,;37.91,-42.78,;36.58,-43.55,;35.25,-42.78,;35.25,-41.24,;33.91,-43.55,;32.58,-42.77,;33.91,-45.09,;32.58,-45.86,;31.24,-45.09,;29.9,-45.86,;28.56,-45.09,;29.91,-47.4,;31.25,-48.16,;32.57,-47.39,;34.05,-47.79,;32.97,-48.88,;28.57,-48.17,;27.24,-47.41,;25.91,-48.18,;25.91,-49.72,;27.24,-50.5,;28.58,-49.72,;29.91,-50.49,;39.25,-43.55,;39.25,-45.09,;40.58,-42.79,;41.92,-43.55,;43.12,-42.28,;43.11,-40.79,;44.45,-40.31,;43.41,-41.55,;43.41,-43.13,;44.83,-43.7,;45.83,-42.42,;47.28,-42.94,;45.85,-40.89,;44.44,-42.77,)|
Show InChI InChI=1S/C31H47ClN4O4/c1-18(2)22(29(39)34-28-20-9-19-10-21(28)14-31(40,12-19)13-20)11-26(37)24(33)15-35-16-27(38)36(17-30(35,3)4)25-8-6-5-7-23(25)32/h5-8,18-22,24,26,28,37,40H,9-17,33H2,1-4H3,(H,34,39)/t19?,20?,21?,22-,24-,26-,28-,31-/m0/s1
n/an/a 2.20n/an/an/an/an/an/a
Daiichi Sankyo Co., Ltd
Curated by ChEMBL
Assay Description
Inhibition of renin in cynomolgus monkey plasma after 1 hr by RIA
Bioorg Med Chem 21: 3175-96 (2013)
Article DOI: 10.1016/j.bmc.2013.03.022
BindingDB Entry DOI: 10.7270/Q2GT5PJK
Renin
(Homo sapiens (Human))
BDBM50434426
(CHEMBL2387566)
Show SMILES CC(C)[C@H](C[C@H](O)[C@@H](N)CN1CC(=O)N(CC1(C)C)c1ccccc1Cl)C(=O)N[C@H]1C2CC3CC1C[C@](O)(C3)C2 |r,wU:5.5,3.3,29.30,wD:36.39,7.7,TLB:28:29:39.35.36:33.32.31,28:29:31:39.36.38,37:36:29:33.32.31,THB:35:34:31:39.36.38,35:36:29.34.33:31,38:36:29:33.32.31,38:32:29:39.35.36,(39.25,-40.47,;37.92,-41.24,;36.58,-40.47,;37.91,-42.78,;36.58,-43.55,;35.25,-42.78,;35.25,-41.24,;33.91,-43.55,;32.58,-42.77,;33.91,-45.09,;32.58,-45.86,;31.24,-45.09,;29.9,-45.86,;28.56,-45.09,;29.91,-47.4,;31.25,-48.16,;32.57,-47.39,;34.05,-47.79,;32.97,-48.88,;28.57,-48.17,;27.24,-47.41,;25.91,-48.18,;25.91,-49.72,;27.24,-50.5,;28.58,-49.72,;29.91,-50.49,;39.25,-43.55,;39.25,-45.09,;40.58,-42.79,;41.92,-43.55,;43.12,-42.28,;43.11,-40.79,;44.45,-40.31,;43.41,-41.55,;43.41,-43.13,;44.83,-43.7,;45.83,-42.42,;47.28,-42.94,;45.85,-40.89,;44.44,-42.77,)|
Show InChI InChI=1S/C31H47ClN4O4/c1-18(2)22(29(39)34-28-20-9-19-10-21(28)14-31(40,12-19)13-20)11-26(37)24(33)15-35-16-27(38)36(17-30(35,3)4)25-8-6-5-7-23(25)32/h5-8,18-22,24,26,28,37,40H,9-17,33H2,1-4H3,(H,34,39)/t19?,20?,21?,22-,24-,26-,28-,31-/m0/s1
Reactome pathway
n/an/a 1.30n/an/an/an/an/an/a
Daiichi Sankyo Co., Ltd
Curated by ChEMBL
Assay Description
Inhibition of human recombinant renin using Arg-Glu(EDANS)-Ile-His-Pro-Phe-His-Leu-Val-Ile-His-Thr-Lys (DABCYL)-Arg as substrate incubated for 10 min...
Bioorg Med Chem 21: 3175-96 (2013)
Article DOI: 10.1016/j.bmc.2013.03.022
BindingDB Entry DOI: 10.7270/Q2GT5PJK