BDBM50434428 CHEMBL2387564
SMILES: CC[C@H](C[C@H](O)[C@@H](N)CN1CC(=O)N(CC1(C)C)c1ccccc1Cl)C(=O)NCC1(CO)CCCC1
InChI Key: InChIKey=LVTAAFUXHZCJIX-NWSQWKLXSA-N
Data: 2 IC50
Activity Spreadsheet -- Enzyme Inhibition Constant Data from BindingDB
Found 2 hits for monomerid = 50434428
Trg + Lig
Ki
nM
ΔG°
kcal/mole
IC50
nM
Kd
nM
EC50/IC50
nM
koff
s-1
kon
M-1s-1
pHTemp
°C
Renin
(Macaca fascicularis)
BDBM50434428
(CHEMBL2387564)
Show SMILES CC[C@H](C[C@H](O)[C@@H](N)CN1CC(=O)N(CC1(C)C)c1ccccc1Cl)C(=O)NCC1(CO)CCCC1 |r|
Show InChI InChI=1S/C27H43ClN4O4/c1-4-19(25(36)30-16-27(18-33)11-7-8-12-27)13-23(34)21(29)14-31-15-24(35)32(17-26(31,2)3)22-10-6-5-9-20(22)28/h5-6,9-10,19,21,23,33-34H,4,7-8,11-18,29H2,1-3H3,(H,30,36)/t19-,21+,23+/m1/s1
n/an/a 3n/an/an/an/an/an/a
Daiichi Sankyo Co., Ltd
Curated by ChEMBL
Assay Description
Inhibition of renin in cynomolgus monkey plasma after 1 hr by RIA
Bioorg Med Chem 21: 3175-96 (2013)
Article DOI: 10.1016/j.bmc.2013.03.022
BindingDB Entry DOI: 10.7270/Q2GT5PJK
Renin
(Homo sapiens (Human))
BDBM50434428
(CHEMBL2387564)
Show SMILES CC[C@H](C[C@H](O)[C@@H](N)CN1CC(=O)N(CC1(C)C)c1ccccc1Cl)C(=O)NCC1(CO)CCCC1 |r|
Show InChI InChI=1S/C27H43ClN4O4/c1-4-19(25(36)30-16-27(18-33)11-7-8-12-27)13-23(34)21(29)14-31-15-24(35)32(17-26(31,2)3)22-10-6-5-9-20(22)28/h5-6,9-10,19,21,23,33-34H,4,7-8,11-18,29H2,1-3H3,(H,30,36)/t19-,21+,23+/m1/s1
Reactome pathway
n/an/a 1.10n/an/an/an/an/an/a
Daiichi Sankyo Co., Ltd
Curated by ChEMBL
Assay Description
Inhibition of human recombinant renin using Arg-Glu(EDANS)-Ile-His-Pro-Phe-His-Leu-Val-Ile-His-Thr-Lys (DABCYL)-Arg as substrate incubated for 10 min...
Bioorg Med Chem 21: 3175-96 (2013)
Article DOI: 10.1016/j.bmc.2013.03.022
BindingDB Entry DOI: 10.7270/Q2GT5PJK