BDBM50434434 CHEMBL2387558
SMILES: CC[C@H](C[C@H](O)[C@@H](N)CN1CC(=O)N(CC1(C)C)c1ccccc1Cl)C(=O)Nc1ccc(F)cn1
InChI Key: InChIKey=QKTUTYYRRYUCPR-PBEJRMEISA-N
Data: 2 IC50
Activity Spreadsheet -- Enzyme Inhibition Constant Data from BindingDB
Found 2 hits for monomerid = 50434434
Trg + Lig
Ki
nM
ΔG°
kcal/mole
IC50
nM
Kd
nM
EC50/IC50
nM
koff
s-1
kon
M-1s-1
pHTemp
°C
Renin
(Macaca fascicularis)
BDBM50434434
(CHEMBL2387558)
Show SMILES CC[C@H](C[C@H](O)[C@@H](N)CN1CC(=O)N(CC1(C)C)c1ccccc1Cl)C(=O)Nc1ccc(F)cn1 |r|
Show InChI InChI=1S/C25H33ClFN5O3/c1-4-16(24(35)30-22-10-9-17(27)12-29-22)11-21(33)19(28)13-31-14-23(34)32(15-25(31,2)3)20-8-6-5-7-18(20)26/h5-10,12,16,19,21,33H,4,11,13-15,28H2,1-3H3,(H,29,30,35)/t16-,19+,21+/m1/s1
n/an/a 2.10n/an/an/an/an/an/a
Daiichi Sankyo Co., Ltd
Curated by ChEMBL
Assay Description
Inhibition of renin in cynomolgus monkey plasma after 1 hr by RIA
Bioorg Med Chem 21: 3175-96 (2013)
Article DOI: 10.1016/j.bmc.2013.03.022
BindingDB Entry DOI: 10.7270/Q2GT5PJK
Renin
(Homo sapiens (Human))
BDBM50434434
(CHEMBL2387558)
Show SMILES CC[C@H](C[C@H](O)[C@@H](N)CN1CC(=O)N(CC1(C)C)c1ccccc1Cl)C(=O)Nc1ccc(F)cn1 |r|
Show InChI InChI=1S/C25H33ClFN5O3/c1-4-16(24(35)30-22-10-9-17(27)12-29-22)11-21(33)19(28)13-31-14-23(34)32(15-25(31,2)3)20-8-6-5-7-18(20)26/h5-10,12,16,19,21,33H,4,11,13-15,28H2,1-3H3,(H,29,30,35)/t16-,19+,21+/m1/s1
Reactome pathway
n/an/a 1n/an/an/an/an/an/a
Daiichi Sankyo Co., Ltd
Curated by ChEMBL
Assay Description
Inhibition of human recombinant renin using Arg-Glu(EDANS)-Ile-His-Pro-Phe-His-Leu-Val-Ile-His-Thr-Lys (DABCYL)-Arg as substrate incubated for 10 min...
Bioorg Med Chem 21: 3175-96 (2013)
Article DOI: 10.1016/j.bmc.2013.03.022
BindingDB Entry DOI: 10.7270/Q2GT5PJK