BDBM50434438 CHEMBL2387554
SMILES: CC[C@H](C[C@H](O)[C@@H](N)CN1CC(=O)N(CC1(C)C)c1ccccc1Cl)C(=O)Nc1ccc(OC)cc1
InChI Key: InChIKey=YXPBRJOHFAUJQU-OUOWLKGYSA-N
Data: 2 IC50
Activity Spreadsheet -- Enzyme Inhibition Constant Data from BindingDB
Found 2 hits for monomerid = 50434438
Trg + Lig
Ki
nM
ΔG°
kcal/mole
IC50
nM
Kd
nM
EC50/IC50
nM
koff
s-1
kon
M-1s-1
pHTemp
°C
Renin
(Macaca fascicularis)
BDBM50434438
(CHEMBL2387554)
Show SMILES CC[C@H](C[C@H](O)[C@@H](N)CN1CC(=O)N(CC1(C)C)c1ccccc1Cl)C(=O)Nc1ccc(OC)cc1 |r|
Show InChI InChI=1S/C27H37ClN4O4/c1-5-18(26(35)30-19-10-12-20(36-4)13-11-19)14-24(33)22(29)15-31-16-25(34)32(17-27(31,2)3)23-9-7-6-8-21(23)28/h6-13,18,22,24,33H,5,14-17,29H2,1-4H3,(H,30,35)/t18-,22+,24+/m1/s1
n/an/a 11n/an/an/an/an/an/a
Daiichi Sankyo Co., Ltd
Curated by ChEMBL
Assay Description
Inhibition of renin in cynomolgus monkey plasma after 1 hr by RIA
Bioorg Med Chem 21: 3175-96 (2013)
Article DOI: 10.1016/j.bmc.2013.03.022
BindingDB Entry DOI: 10.7270/Q2GT5PJK
Renin
(Homo sapiens (Human))
BDBM50434438
(CHEMBL2387554)
Show SMILES CC[C@H](C[C@H](O)[C@@H](N)CN1CC(=O)N(CC1(C)C)c1ccccc1Cl)C(=O)Nc1ccc(OC)cc1 |r|
Show InChI InChI=1S/C27H37ClN4O4/c1-5-18(26(35)30-19-10-12-20(36-4)13-11-19)14-24(33)22(29)15-31-16-25(34)32(17-27(31,2)3)23-9-7-6-8-21(23)28/h6-13,18,22,24,33H,5,14-17,29H2,1-4H3,(H,30,35)/t18-,22+,24+/m1/s1
Reactome pathway
n/an/a 1.40n/an/an/an/an/an/a
Daiichi Sankyo Co., Ltd
Curated by ChEMBL
Assay Description
Inhibition of human recombinant renin using Arg-Glu(EDANS)-Ile-His-Pro-Phe-His-Leu-Val-Ile-His-Thr-Lys (DABCYL)-Arg as substrate incubated for 10 min...
Bioorg Med Chem 21: 3175-96 (2013)
Article DOI: 10.1016/j.bmc.2013.03.022
BindingDB Entry DOI: 10.7270/Q2GT5PJK