BDBM50434504 CHEMBL2385532
SMILES: Clc1ccc(cc1)-c1cc2Cc3cc(ccc3N(CC=C)C(=O)c2o1)N1CCNCC1
InChI Key: InChIKey=XBBIPFACLROYIA-UHFFFAOYSA-N
Data: 1 IC50
Activity Spreadsheet -- Enzyme Inhibition Constant Data from BindingDB
Found 1 hit for monomerid = 50434504
Trg + Lig
Ki
nM
ΔG°
kcal/mole
IC50
nM
Kd
nM
EC50/IC50
nM
koff
s-1
kon
M-1s-1
pHTemp
°C
MAP kinase-activated protein kinase 2
(Homo sapiens (Human))
BDBM50434504
(CHEMBL2385532)
Show SMILES Clc1ccc(cc1)-c1cc2Cc3cc(ccc3N(CC=C)C(=O)c2o1)N1CCNCC1
Show InChI InChI=1S/C25H24ClN3O2/c1-2-11-29-22-8-7-21(28-12-9-27-10-13-28)15-18(22)14-19-16-23(31-24(19)25(29)30)17-3-5-20(26)6-4-17/h2-8,15-16,27H,1,9-14H2
NCI pathway
Reactome pathway
n/an/a 12n/an/an/an/an/an/a
Merck Research Laboratories
Curated by ChEMBL
Assay Description
Inhibition of MK2 (unknown origin) phosphorylation using TAMRA labeled peptide as substrate incubated 30 mins before substrate addition measured afte...
Bioorg Med Chem Lett 23: 3262-6 (2013)
Article DOI: 10.1016/j.bmcl.2013.03.109
BindingDB Entry DOI: 10.7270/Q2ZS2XX8