BDBM50434610 CHEMBL2386807
SMILES: Cc1cc(NC(=O)NCc2ccc(cc2)-c2cc(Nc3cc(nc(C)n3)N3CCN(CCO)CC3)[nH]n2)no1
InChI Key: InChIKey=JFOZUFLYZRDCRJ-UHFFFAOYSA-N
Data: 2 IC50
Activity Spreadsheet -- Enzyme Inhibition Constant Data from BindingDB
Found 2 hits for monomerid = 50434610
Trg + Lig
Ki
nM
ΔG°
kcal/mole
IC50
nM
Kd
nM
EC50/IC50
nM
koff
s-1
kon
M-1s-1
pHTemp
°C
Aurora kinase A
(Homo sapiens (Human))
BDBM50434610
(CHEMBL2386807)
Show SMILES Cc1cc(NC(=O)NCc2ccc(cc2)-c2cc(Nc3cc(nc(C)n3)N3CCN(CCO)CC3)[nH]n2)no1
Show InChI InChI=1S/C26H32N10O3/c1-17-13-24(34-39-17)31-26(38)27-16-19-3-5-20(6-4-19)21-14-23(33-32-21)30-22-15-25(29-18(2)28-22)36-9-7-35(8-10-36)11-12-37/h3-6,13-15,37H,7-12,16H2,1-2H3,(H2,27,31,34,38)(H2,28,29,30,32,33)
NCI pathway
Reactome pathway
n/an/a 98n/an/an/an/an/an/a
National Health Research Institutes
Curated by ChEMBL
Assay Description
Inhibition of recombinant GST tagged Aurora A kinase (123 to 401) (unknown origin) transfected in insect sf9 cells after 90 mins by wallac counting a...
Bioorg Med Chem 21: 2856-67 (2013)
Article DOI: 10.1016/j.bmc.2013.03.083
BindingDB Entry DOI: 10.7270/Q22N53NF
Receptor-type tyrosine-protein kinase FLT3
(Homo sapiens (Human))
BDBM50434610
(CHEMBL2386807)
Show SMILES Cc1cc(NC(=O)NCc2ccc(cc2)-c2cc(Nc3cc(nc(C)n3)N3CCN(CCO)CC3)[nH]n2)no1
Show InChI InChI=1S/C26H32N10O3/c1-17-13-24(34-39-17)31-26(38)27-16-19-3-5-20(6-4-19)21-14-23(33-32-21)30-22-15-25(29-18(2)28-22)36-9-7-35(8-10-36)11-12-37/h3-6,13-15,37H,7-12,16H2,1-2H3,(H2,27,31,34,38)(H2,28,29,30,32,33)
n/an/a 17n/an/an/an/an/an/a
National Health Research Institutes
Curated by ChEMBL
Assay Description
Inhibition of wild type GST tagged FLT3 kinase (567 to 993) (unknown origin) transfected in insect sf9 cells after 4 hrs by wallac counting analysis
Bioorg Med Chem 21: 2856-67 (2013)
Article DOI: 10.1016/j.bmc.2013.03.083
BindingDB Entry DOI: 10.7270/Q22N53NF