BDBM50434627 CHEMBL2386790
SMILES: CN1CCN(CC1)c1ccc(cc1)C(=O)Nc1cc(n[nH]1)-c1ccc(NC(=O)Nc2cc(C)on2)c(C)c1
InChI Key: InChIKey=MZOIOQHNRFBXRZ-UHFFFAOYSA-N
Data: 2 IC50
Activity Spreadsheet -- Enzyme Inhibition Constant Data from BindingDB
Found 2 hits for monomerid = 50434627
Trg + Lig
Ki
nM
ΔG°
kcal/mole
IC50
nM
Kd
nM
EC50/IC50
nM
koff
s-1
kon
M-1s-1
pHTemp
°C
Aurora kinase A
(Homo sapiens (Human))
BDBM50434627
(CHEMBL2386790)
Show SMILES CN1CCN(CC1)c1ccc(cc1)C(=O)Nc1cc(n[nH]1)-c1ccc(NC(=O)Nc2cc(C)on2)c(C)c1
Show InChI InChI=1S/C27H30N8O3/c1-17-14-20(6-9-22(17)28-27(37)30-25-15-18(2)38-33-25)23-16-24(32-31-23)29-26(36)19-4-7-21(8-5-19)35-12-10-34(3)11-13-35/h4-9,14-16H,10-13H2,1-3H3,(H2,28,30,33,37)(H2,29,31,32,36)
NCI pathway
Reactome pathway
n/an/a 250n/an/an/an/an/an/a
National Health Research Institutes
Curated by ChEMBL
Assay Description
Inhibition of recombinant GST tagged Aurora A kinase (123 to 401) (unknown origin) transfected in insect sf9 cells after 90 mins by wallac counting a...
Bioorg Med Chem 21: 2856-67 (2013)
Article DOI: 10.1016/j.bmc.2013.03.083
BindingDB Entry DOI: 10.7270/Q22N53NF
Receptor-type tyrosine-protein kinase FLT3
(Homo sapiens (Human))
BDBM50434627
(CHEMBL2386790)
Show SMILES CN1CCN(CC1)c1ccc(cc1)C(=O)Nc1cc(n[nH]1)-c1ccc(NC(=O)Nc2cc(C)on2)c(C)c1
Show InChI InChI=1S/C27H30N8O3/c1-17-14-20(6-9-22(17)28-27(37)30-25-15-18(2)38-33-25)23-16-24(32-31-23)29-26(36)19-4-7-21(8-5-19)35-12-10-34(3)11-13-35/h4-9,14-16H,10-13H2,1-3H3,(H2,28,30,33,37)(H2,29,31,32,36)
n/an/a 9n/an/an/an/an/an/a
National Health Research Institutes
Curated by ChEMBL
Assay Description
Inhibition of wild type GST tagged FLT3 kinase (567 to 993) (unknown origin) transfected in insect sf9 cells after 4 hrs by wallac counting analysis
Bioorg Med Chem 21: 2856-67 (2013)
Article DOI: 10.1016/j.bmc.2013.03.083
BindingDB Entry DOI: 10.7270/Q22N53NF