BDBM50434646 CHEMBL2387193
SMILES: O=C1Cc2ccccc2N1C1CCN(CC1)C1CC[C@H]2CCCc3cccc1c23
InChI Key: InChIKey=SZKWDIATUVLAAW-PHSANKKPSA-N
Data: 1 KI  1 EC50
Activity Spreadsheet -- Enzyme Inhibition Constant Data from BindingDB
Found 2 hits for monomerid = 50434646
Trg + Lig
Ki
nM
ΔG°
kcal/mole
IC50
nM
Kd
nM
EC50/IC50
nM
koff
s-1
kon
M-1s-1
pHTemp
°C
Nociceptin receptor
(Homo sapiens (Human))
BDBM50434646
(CHEMBL2387193)
Show SMILES O=C1Cc2ccccc2N1C1CCN(CC1)C1CC[C@H]2CCCc3cccc1c23 |r|
Show InChI InChI=1S/C26H30N2O/c29-25-17-20-5-1-2-10-23(20)28(25)21-13-15-27(16-14-21)24-12-11-19-7-3-6-18-8-4-9-22(24)26(18)19/h1-2,4-5,8-10,19,21,24H,3,6-7,11-17H2/t19-,24?/m1/s1
Reactome pathway
11n/an/an/an/an/an/an/an/a
Astraea Therapeutics, LLC.
Curated by ChEMBL
Assay Description
Displacement of [3H] N/OFQ from human nociceptin receptor transfected in CHO cells
Bioorg Med Chem Lett 23: 3308-13 (2013)
Article DOI: 10.1016/j.bmcl.2013.03.101
BindingDB Entry DOI: 10.7270/Q2T43VHN
Nociceptin receptor
(Homo sapiens (Human))
BDBM50434646
(CHEMBL2387193)
Show SMILES O=C1Cc2ccccc2N1C1CCN(CC1)C1CC[C@H]2CCCc3cccc1c23 |r|
Show InChI InChI=1S/C26H30N2O/c29-25-17-20-5-1-2-10-23(20)28(25)21-13-15-27(16-14-21)24-12-11-19-7-3-6-18-8-4-9-22(24)26(18)19/h1-2,4-5,8-10,19,21,24H,3,6-7,11-17H2/t19-,24?/m1/s1
Reactome pathway
n/an/an/an/a 46n/an/an/an/a
Astraea Therapeutics, LLC.
Curated by ChEMBL
Assay Description
Agonist activity at human nociceptin receptor transfected in CHO cells assessed as stimulation of [35S]GTPgammaS binding by liquid scintillation coun...
Bioorg Med Chem Lett 23: 3308-13 (2013)
Article DOI: 10.1016/j.bmcl.2013.03.101
BindingDB Entry DOI: 10.7270/Q2T43VHN