null
SMILES: B[P@](=O)(OC[C@H]1O[C@H]([C@H](O)[C@@H]1O)n1cnc2c(N)nc(Cl)nc12)OP(O)(O)=O
InChI Key: InChIKey=BKMFDOGRJDKZHH-SUSBGDECSA-N
Activity Spreadsheet -- Enzyme Inhibition Constant Data from BindingDB
Found 2 hits for monomerid = 50435010
Trg + Lig
Ki
nM
ΔG°
kcal/mole
IC50
nM
Kd
nM
EC50/IC50
nM
koff
s-1
kon
M-1s-1
pHTemp
°C
P2Y purinoceptor 1
(Homo sapiens (Human))
BDBM50435010
(CHEMBL2386492)
Show SMILES B[P@](=O)(OC[C@H]1O[C@H]([C@H](O)[C@@H]1O)n1cnc2c(N)nc(Cl)nc12)OP(O)(O)=O |r|
Show InChI InChI=1S/C10H15BClN5O9P2/c11-27(20,26-28(21,22)23)24-1-3-5(18)6(19)9(25-3)17-2-14-4-7(13)15-10(12)16-8(4)17/h2-3,5-6,9,18-19H,1,11H2,(H2,13,15,16)(H2,21,22,23)/t3-,5-,6-,9-,27+/m1/s1
n/an/an/an/a 600n/an/an/an/a
Bar-Ilan University
Curated by ChEMBL
Assay Description
Agonist activity at human GFP-tagged P2Y1R transfected in human 1321N1 cells assessed as induction of intracellular calcium mobilization by fluoresce...
J Med Chem 56: 4938-52 (2013)
Article DOI: 10.1021/jm400197m
BindingDB Entry DOI: 10.7270/Q2Q52R0Q
P2Y purinoceptor 11
(Homo sapiens (Human))
BDBM50435010
(CHEMBL2386492)
Show SMILES B[P@](=O)(OC[C@H]1O[C@H]([C@H](O)[C@@H]1O)n1cnc2c(N)nc(Cl)nc12)OP(O)(O)=O |r|
Show InChI InChI=1S/C10H15BClN5O9P2/c11-27(20,26-28(21,22)23)24-1-3-5(18)6(19)9(25-3)17-2-14-4-7(13)15-10(12)16-8(4)17/h2-3,5-6,9,18-19H,1,11H2,(H2,13,15,16)(H2,21,22,23)/t3-,5-,6-,9-,27+/m1/s1
Reactome pathway
n/an/an/an/a 1.00E+3n/an/an/an/a
Bar-Ilan University
Curated by ChEMBL
Assay Description
Agonist activity at human GFP-tagged P2Y11R transfected in human 1321N1 cells assessed as induction of intracellular calcium mobilization by fluoresc...
J Med Chem 56: 4938-52 (2013)
Article DOI: 10.1021/jm400197m
BindingDB Entry DOI: 10.7270/Q2Q52R0Q