BDBM50435047 CHEMBL2391299
SMILES: OC[C@H]1CCC[C@@H](C1)NC(=O)C1CCN(CC1)c1nc2cc(Cl)c(cc2o1)-c1ccc(F)cc1
InChI Key: InChIKey=FPSZXXWPGUVFTR-JXFKEZNVSA-N
Data: 2 IC50
Activity Spreadsheet -- Enzyme Inhibition Constant Data from BindingDB
Found 2 hits for monomerid = 50435047
Trg + Lig
Ki
nM
ΔG°
kcal/mole
IC50
nM
Kd
nM
EC50/IC50
nM
koff
s-1
kon
M-1s-1
pHTemp
°C
Prostaglandin E synthase
(Homo sapiens (Human))
BDBM50435047
(CHEMBL2391299)
Show SMILES OC[C@H]1CCC[C@@H](C1)NC(=O)C1CCN(CC1)c1nc2cc(Cl)c(cc2o1)-c1ccc(F)cc1 |r|
Show InChI InChI=1S/C26H29ClFN3O3/c27-22-14-23-24(13-21(22)17-4-6-19(28)7-5-17)34-26(30-23)31-10-8-18(9-11-31)25(33)29-20-3-1-2-16(12-20)15-32/h4-7,13-14,16,18,20,32H,1-3,8-12,15H2,(H,29,33)/t16-,20-/m0/s1
Reactome pathway
n/an/a 119n/an/an/an/an/an/a
Pfizer Inc.
Curated by ChEMBL
Assay Description
Inhibition of mPGES-1-mediated PGE2 production in LPS-stimulated healthy human whole blood after 20 to 24 hrs by ELISA
Bioorg Med Chem Lett 23: 1114-9 (2013)
Article DOI: 10.1016/j.bmcl.2012.11.109
BindingDB Entry DOI: 10.7270/Q2FQ9Z0W
Prostaglandin E synthase
(Homo sapiens (Human))
BDBM50435047
(CHEMBL2391299)
Show SMILES OC[C@H]1CCC[C@@H](C1)NC(=O)C1CCN(CC1)c1nc2cc(Cl)c(cc2o1)-c1ccc(F)cc1 |r|
Show InChI InChI=1S/C26H29ClFN3O3/c27-22-14-23-24(13-21(22)17-4-6-19(28)7-5-17)34-26(30-23)31-10-8-18(9-11-31)25(33)29-20-3-1-2-16(12-20)15-32/h4-7,13-14,16,18,20,32H,1-3,8-12,15H2,(H,29,33)/t16-,20-/m0/s1
Reactome pathway
n/an/a 3n/an/an/an/an/an/a
Pfizer Inc.
Curated by ChEMBL
Assay Description
Inhibition of mPGES-1 (unknown origin) using PGH2 as substrate assessed as PGE2 synthesis by ELISA
Bioorg Med Chem Lett 23: 1114-9 (2013)
Article DOI: 10.1016/j.bmcl.2012.11.109
BindingDB Entry DOI: 10.7270/Q2FQ9Z0W