null
SMILES: COc1ccc(cc1)N(C)c1nc(N)nc2[nH]c3ccccc3c12
InChI Key: InChIKey=LXPCMMVNRMVBIT-UHFFFAOYSA-N
Activity Spreadsheet -- Enzyme Inhibition Constant Data from BindingDB
Found 1 hit for monomerid = 50435114
Trg + Lig
Ki
nM
ΔG°
kcal/mole
IC50
nM
Kd
nM
EC50/IC50
nM
koff
s-1
kon
M-1s-1
pHTemp
°C
ATP-dependent translocase ABCB1
(Homo sapiens (Human))
BDBM50435114
(CHEMBL2391709)
Show SMILES COc1ccc(cc1)N(C)c1nc(N)nc2[nH]c3ccccc3c12
Show InChI InChI=1S/C18H17N5O/c1-23(11-7-9-12(24-2)10-8-11)17-15-13-5-3-4-6-14(13)20-16(15)21-18(19)22-17/h3-10H,1-2H3,(H3,19,20,21,22)
n/an/a 34n/an/an/an/an/an/a
Duquesne University
Curated by ChEMBL
Assay Description
Inhibition of MDR1 (unknown origin) transfected in human SKOV3 cells assessed as growth inhibition after 48 hrs by SRB assay
Bioorg Med Chem 21: 891-902 (2013)
Article DOI: 10.1016/j.bmc.2012.12.010
BindingDB Entry DOI: 10.7270/Q2XP7692