BDBM50435200 CHEMBL2392916
SMILES: Cc1nc(nc(NC[C@H](NC(=O)CCCCc2ccccc2)c2ccccc2)c1Cl)-c1ccc(Cl)cn1
InChI Key: InChIKey=OEJKJSOGQPAPOY-VWLOTQADSA-N
Data: 2 EC50
Activity Spreadsheet -- Enzyme Inhibition Constant Data from BindingDB
Found 2 hits for monomerid = 50435200
Trg + Lig
Ki
nM
ΔG°
kcal/mole
IC50
nM
Kd
nM
EC50/IC50
nM
koff
s-1
kon
M-1s-1
pHTemp
°C
Methionine Aminopeptidase Type 1 (MetAP1)
(Homo sapiens (Human))
BDBM50435200
(CHEMBL2392916)
Show SMILES Cc1nc(nc(NC[C@H](NC(=O)CCCCc2ccccc2)c2ccccc2)c1Cl)-c1ccc(Cl)cn1 |r|
Show InChI InChI=1S/C29H29Cl2N5O/c1-20-27(31)29(36-28(34-20)24-17-16-23(30)18-32-24)33-19-25(22-13-6-3-7-14-22)35-26(37)15-9-8-12-21-10-4-2-5-11-21/h2-7,10-11,13-14,16-18,25H,8-9,12,15,19H2,1H3,(H,35,37)(H,33,34,36)/t25-/m0/s1
Reactome pathway
n/an/an/an/a 1.30E+3n/an/an/an/a
Chinese Academy of Sciences
Curated by ChEMBL
Assay Description
Inhibition of human recombinant full-length cytosolic METAP1 expressed in Escherichia coli BL21(DE3) using Met-Pro-p-nitroanilide as substrate after ...
Bioorg Med Chem 21: 2600-17 (2013)
Article DOI: 10.1016/j.bmc.2013.02.023
BindingDB Entry DOI: 10.7270/Q290256X
Microtubule-associated protein 2
(Homo sapiens (Human))
BDBM50435200
(CHEMBL2392916)
Show SMILES Cc1nc(nc(NC[C@H](NC(=O)CCCCc2ccccc2)c2ccccc2)c1Cl)-c1ccc(Cl)cn1 |r|
Show InChI InChI=1S/C29H29Cl2N5O/c1-20-27(31)29(36-28(34-20)24-17-16-23(30)18-32-24)33-19-25(22-13-6-3-7-14-22)35-26(37)15-9-8-12-21-10-4-2-5-11-21/h2-7,10-11,13-14,16-18,25H,8-9,12,15,19H2,1H3,(H,35,37)(H,33,34,36)/t25-/m0/s1
n/an/an/an/a>3.00E+4n/an/an/an/a
Chinese Academy of Sciences
Curated by ChEMBL
Assay Description
Inhibition of human recombinant GST-6XHis-tagged full-length cytosolic METAP2 expressed in cabbage looper BTI-TN-5B1-4 cells using Met-Pro-p-nitroani...
Bioorg Med Chem 21: 2600-17 (2013)
Article DOI: 10.1016/j.bmc.2013.02.023
BindingDB Entry DOI: 10.7270/Q290256X