BDBM50435201 CHEMBL2392915
SMILES: Cc1nc(nc(NC[C@H](NC(=O)CCCc2ccccc2)c2ccccc2)c1Cl)-c1ccc(Cl)cn1
InChI Key: InChIKey=QZLKLWALIASERX-DEOSSOPVSA-N
Data: 2 EC50
Activity Spreadsheet -- Enzyme Inhibition Constant Data from BindingDB
Found 2 hits for monomerid = 50435201
Trg + Lig
Ki
nM
ΔG°
kcal/mole
IC50
nM
Kd
nM
EC50/IC50
nM
koff
s-1
kon
M-1s-1
pHTemp
°C
Methionine Aminopeptidase Type 1 (MetAP1)
(Homo sapiens (Human))
BDBM50435201
(CHEMBL2392915)
Show SMILES Cc1nc(nc(NC[C@H](NC(=O)CCCc2ccccc2)c2ccccc2)c1Cl)-c1ccc(Cl)cn1 |r|
Show InChI InChI=1S/C28H27Cl2N5O/c1-19-26(30)28(35-27(33-19)23-16-15-22(29)17-31-23)32-18-24(21-12-6-3-7-13-21)34-25(36)14-8-11-20-9-4-2-5-10-20/h2-7,9-10,12-13,15-17,24H,8,11,14,18H2,1H3,(H,34,36)(H,32,33,35)/t24-/m0/s1
Reactome pathway
n/an/an/an/a 160n/an/an/an/a
Chinese Academy of Sciences
Curated by ChEMBL
Assay Description
Inhibition of human recombinant full-length cytosolic METAP1 expressed in Escherichia coli BL21(DE3) using Met-Pro-p-nitroanilide as substrate after ...
Bioorg Med Chem 21: 2600-17 (2013)
Article DOI: 10.1016/j.bmc.2013.02.023
BindingDB Entry DOI: 10.7270/Q290256X
Microtubule-associated protein 2
(Homo sapiens (Human))
BDBM50435201
(CHEMBL2392915)
Show SMILES Cc1nc(nc(NC[C@H](NC(=O)CCCc2ccccc2)c2ccccc2)c1Cl)-c1ccc(Cl)cn1 |r|
Show InChI InChI=1S/C28H27Cl2N5O/c1-19-26(30)28(35-27(33-19)23-16-15-22(29)17-31-23)32-18-24(21-12-6-3-7-13-21)34-25(36)14-8-11-20-9-4-2-5-10-20/h2-7,9-10,12-13,15-17,24H,8,11,14,18H2,1H3,(H,34,36)(H,32,33,35)/t24-/m0/s1
n/an/an/an/a>3.00E+4n/an/an/an/a
Chinese Academy of Sciences
Curated by ChEMBL
Assay Description
Inhibition of human recombinant GST-6XHis-tagged full-length cytosolic METAP2 expressed in cabbage looper BTI-TN-5B1-4 cells using Met-Pro-p-nitroani...
Bioorg Med Chem 21: 2600-17 (2013)
Article DOI: 10.1016/j.bmc.2013.02.023
BindingDB Entry DOI: 10.7270/Q290256X