BDBM50435202 CHEMBL2392914
SMILES: Cc1nc(nc(NC[C@H](NC(=O)CCc2ccccc2)c2ccccc2)c1Cl)-c1ccc(Cl)cn1
InChI Key: InChIKey=IWPKHWAHQNLSRO-QHCPKHFHSA-N
Data: 2 EC50
Activity Spreadsheet -- Enzyme Inhibition Constant Data from BindingDB
Found 2 hits for monomerid = 50435202
Trg + Lig
Ki
nM
ΔG°
kcal/mole
IC50
nM
Kd
nM
EC50/IC50
nM
koff
s-1
kon
M-1s-1
pHTemp
°C
Methionine Aminopeptidase Type 1 (MetAP1)
(Homo sapiens (Human))
BDBM50435202
(CHEMBL2392914)
Show SMILES Cc1nc(nc(NC[C@H](NC(=O)CCc2ccccc2)c2ccccc2)c1Cl)-c1ccc(Cl)cn1 |r|
Show InChI InChI=1S/C27H25Cl2N5O/c1-18-25(29)27(34-26(32-18)22-14-13-21(28)16-30-22)31-17-23(20-10-6-3-7-11-20)33-24(35)15-12-19-8-4-2-5-9-19/h2-11,13-14,16,23H,12,15,17H2,1H3,(H,33,35)(H,31,32,34)/t23-/m0/s1
Reactome pathway
n/an/an/an/a 93n/an/an/an/a
Chinese Academy of Sciences
Curated by ChEMBL
Assay Description
Inhibition of human recombinant full-length cytosolic METAP1 expressed in Escherichia coli BL21(DE3) using Met-Pro-p-nitroanilide as substrate after ...
Bioorg Med Chem 21: 2600-17 (2013)
Article DOI: 10.1016/j.bmc.2013.02.023
BindingDB Entry DOI: 10.7270/Q290256X
Microtubule-associated protein 2
(Homo sapiens (Human))
BDBM50435202
(CHEMBL2392914)
Show SMILES Cc1nc(nc(NC[C@H](NC(=O)CCc2ccccc2)c2ccccc2)c1Cl)-c1ccc(Cl)cn1 |r|
Show InChI InChI=1S/C27H25Cl2N5O/c1-18-25(29)27(34-26(32-18)22-14-13-21(28)16-30-22)31-17-23(20-10-6-3-7-11-20)33-24(35)15-12-19-8-4-2-5-9-19/h2-11,13-14,16,23H,12,15,17H2,1H3,(H,33,35)(H,31,32,34)/t23-/m0/s1
n/an/an/an/a>3.00E+4n/an/an/an/a
Chinese Academy of Sciences
Curated by ChEMBL
Assay Description
Inhibition of human recombinant GST-6XHis-tagged full-length cytosolic METAP2 expressed in cabbage looper BTI-TN-5B1-4 cells using Met-Pro-p-nitroani...
Bioorg Med Chem 21: 2600-17 (2013)
Article DOI: 10.1016/j.bmc.2013.02.023
BindingDB Entry DOI: 10.7270/Q290256X