BDBM50435205 CHEMBL2392912
SMILES: COc1ccnc(c1)-c1nc(C)c(Cl)c(NC[C@H](NC(=O)CCCN2CCNCC2)c2ccccc2)n1
InChI Key: InChIKey=PWPQIEUUVHPJDV-QHCPKHFHSA-N
Data: 2 EC50
Activity Spreadsheet -- Enzyme Inhibition Constant Data from BindingDB
Found 2 hits for monomerid = 50435205
Trg + Lig
Ki
nM
ΔG°
kcal/mole
IC50
nM
Kd
nM
EC50/IC50
nM
koff
s-1
kon
M-1s-1
pHTemp
°C
Methionine Aminopeptidase Type 1 (MetAP1)
(Homo sapiens (Human))
BDBM50435205
(CHEMBL2392912)
Show SMILES COc1ccnc(c1)-c1nc(C)c(Cl)c(NC[C@H](NC(=O)CCCN2CCNCC2)c2ccccc2)n1 |r|
Show InChI InChI=1S/C27H34ClN7O2/c1-19-25(28)27(34-26(32-19)22-17-21(37-2)10-11-30-22)31-18-23(20-7-4-3-5-8-20)33-24(36)9-6-14-35-15-12-29-13-16-35/h3-5,7-8,10-11,17,23,29H,6,9,12-16,18H2,1-2H3,(H,33,36)(H,31,32,34)/t23-/m0/s1
Reactome pathway
n/an/an/an/a 530n/an/an/an/a
Chinese Academy of Sciences
Curated by ChEMBL
Assay Description
Inhibition of human recombinant full-length cytosolic METAP1 expressed in Escherichia coli BL21(DE3) using Met-Pro-p-nitroanilide as substrate after ...
Bioorg Med Chem 21: 2600-17 (2013)
Article DOI: 10.1016/j.bmc.2013.02.023
BindingDB Entry DOI: 10.7270/Q290256X
Microtubule-associated protein 2
(Homo sapiens (Human))
BDBM50435205
(CHEMBL2392912)
Show SMILES COc1ccnc(c1)-c1nc(C)c(Cl)c(NC[C@H](NC(=O)CCCN2CCNCC2)c2ccccc2)n1 |r|
Show InChI InChI=1S/C27H34ClN7O2/c1-19-25(28)27(34-26(32-19)22-17-21(37-2)10-11-30-22)31-18-23(20-7-4-3-5-8-20)33-24(36)9-6-14-35-15-12-29-13-16-35/h3-5,7-8,10-11,17,23,29H,6,9,12-16,18H2,1-2H3,(H,33,36)(H,31,32,34)/t23-/m0/s1
n/an/an/an/a 1.40E+4n/an/an/an/a
Chinese Academy of Sciences
Curated by ChEMBL
Assay Description
Inhibition of human recombinant GST-6XHis-tagged full-length cytosolic METAP2 expressed in cabbage looper BTI-TN-5B1-4 cells using Met-Pro-p-nitroani...
Bioorg Med Chem 21: 2600-17 (2013)
Article DOI: 10.1016/j.bmc.2013.02.023
BindingDB Entry DOI: 10.7270/Q290256X