BDBM50435529 CHEMBL2392783
SMILES: Cc1cncn1CCCNC(=S)Nc1cccc2ncccc12
InChI Key: InChIKey=VDSGHROVXGCVDP-UHFFFAOYSA-N
Data: 1 IC50
Activity Spreadsheet -- Enzyme Inhibition Constant Data from BindingDB
Found 1 hit for monomerid = 50435529
Trg + Lig
Ki
nM
ΔG°
kcal/mole
IC50
nM
Kd
nM
EC50/IC50
nM
koff
s-1
kon
M-1s-1
pHTemp
°C
Glutaminyl Cyclase
(Homo sapiens (Human))
BDBM50435529
(CHEMBL2392783)
Show SMILES Cc1cncn1CCCNC(=S)Nc1cccc2ncccc12
Show InChI InChI=1S/C17H19N5S/c1-13-11-18-12-22(13)10-4-9-20-17(23)21-16-7-2-6-15-14(16)5-3-8-19-15/h2-3,5-8,11-12H,4,9-10H2,1H3,(H2,20,21,23)
n/an/a 375n/an/an/an/an/an/a
Seoul National University
Curated by ChEMBL
Assay Description
Inhibition of human glutaminyl cyclase expressed in HEK293 cells using L-glutaminyl-beta-naphthylamine as substrate after 1 hr by fluorometric analys...
Bioorg Med Chem 21: 3821-30 (2013)
Article DOI: 10.1016/j.bmc.2013.04.005
BindingDB Entry DOI: 10.7270/Q2BR8TJF