BDBM50435583 CHEMBL2393147
SMILES: OCCOc1cccc2n(c(nc12)C(F)F)-c1nc(nc(n1)N1CCOCC1)N1CCOCC1
InChI Key: InChIKey=AWZJYBJOMCIDDP-UHFFFAOYSA-N
Data: 3 IC50
Activity Spreadsheet -- Enzyme Inhibition Constant Data from BindingDB
Found 3 hits for monomerid = 50435583
Trg + Lig
Ki
nM
ΔG°
kcal/mole
IC50
nM
Kd
nM
EC50/IC50
nM
koff
s-1
kon
M-1s-1
pHTemp
°C
Phosphoinositide 3-Kinase (PI3K), delta
(Homo sapiens (Human))
BDBM50435583
(CHEMBL2393147)
Show SMILES OCCOc1cccc2n(c(nc12)C(F)F)-c1nc(nc(n1)N1CCOCC1)N1CCOCC1
Show InChI InChI=1S/C21H25F2N7O4/c22-17(23)18-24-16-14(2-1-3-15(16)34-13-8-31)30(18)21-26-19(28-4-9-32-10-5-28)25-20(27-21)29-6-11-33-12-7-29/h1-3,17,31H,4-13H2
NCI pathway
Reactome pathway
n/an/a 2.60n/an/an/an/an/an/a
University of Auckland
Curated by ChEMBL
Assay Description
Inhibition of recombinant PI3K p110delta/p85alpha (unknown origin) using phosphotidylinositol as susbstrate after 1 hr by thin layer paper chromatogr...
Eur J Med Chem 64: 137-47 (2013)
Article DOI: 10.1016/j.ejmech.2013.03.038
BindingDB Entry DOI: 10.7270/Q2377B33
p110α/p85α
(Homo sapiens (Human))
BDBM50435583
(CHEMBL2393147)
Show SMILES OCCOc1cccc2n(c(nc12)C(F)F)-c1nc(nc(n1)N1CCOCC1)N1CCOCC1
Show InChI InChI=1S/C21H25F2N7O4/c22-17(23)18-24-16-14(2-1-3-15(16)34-13-8-31)30(18)21-26-19(28-4-9-32-10-5-28)25-20(27-21)29-6-11-33-12-7-29/h1-3,17,31H,4-13H2
n/an/a 5.30n/an/an/an/an/an/a
University of Auckland
Curated by ChEMBL
Assay Description
Inhibition of recombinant PI3K p110alpha/p85alpha (unknown origin) using phosphotidylinositol as susbstrate after 1 hr by thin layer paper chromatogr...
Eur J Med Chem 64: 137-47 (2013)
Article DOI: 10.1016/j.ejmech.2013.03.038
BindingDB Entry DOI: 10.7270/Q2377B33
p110β/p85α
(Homo sapiens (Human))
BDBM50435583
(CHEMBL2393147)
Show SMILES OCCOc1cccc2n(c(nc12)C(F)F)-c1nc(nc(n1)N1CCOCC1)N1CCOCC1
Show InChI InChI=1S/C21H25F2N7O4/c22-17(23)18-24-16-14(2-1-3-15(16)34-13-8-31)30(18)21-26-19(28-4-9-32-10-5-28)25-20(27-21)29-6-11-33-12-7-29/h1-3,17,31H,4-13H2
n/an/a 16n/an/an/an/an/an/a
University of Auckland
Curated by ChEMBL
Assay Description
Inhibition of recombinant PI3K p110beta/p85alpha (unknown origin) using phosphotidylinositol as susbstrate after 1 hr by thin layer paper chromatogra...
Eur J Med Chem 64: 137-47 (2013)
Article DOI: 10.1016/j.ejmech.2013.03.038
BindingDB Entry DOI: 10.7270/Q2377B33