BDBM50435724 CHEMBL2392548
SMILES: CN1CCC(CC1)NC(=O)c1ccc(Nc2ncc3N(C)C(=O)C(F)(F)CN(C4CCCC4)c3n2)cc1
InChI Key: InChIKey=BAVKHKJJAGWXBX-UHFFFAOYSA-N
Data: 1 IC50
Activity Spreadsheet -- Enzyme Inhibition Constant Data from BindingDB
Found 1 hit for monomerid = 50435724
Trg + Lig
Ki
nM
ΔG°
kcal/mole
IC50
nM
Kd
nM
EC50/IC50
nM
koff
s-1
kon
M-1s-1
pHTemp
°C
Serine/threonine-protein kinase PLK1
(Homo sapiens (Human))
BDBM50435724
(CHEMBL2392548)
Show SMILES CN1CCC(CC1)NC(=O)c1ccc(Nc2ncc3N(C)C(=O)C(F)(F)CN(C4CCCC4)c3n2)cc1
Show InChI InChI=1S/C26H33F2N7O2/c1-33-13-11-19(12-14-33)30-23(36)17-7-9-18(10-8-17)31-25-29-15-21-22(32-25)35(20-5-3-4-6-20)16-26(27,28)24(37)34(21)2/h7-10,15,19-20H,3-6,11-14,16H2,1-2H3,(H,30,36)(H,29,31,32)
NCI pathway
Reactome pathway
n/an/a 1n/an/an/an/an/an/a
Takeda California
Curated by ChEMBL
Assay Description
Inhibition of PLK1 (unknown origin) using biotin-AGAGTVPESIHSFIGDGLV as substrate by TR-FRET assay
Bioorg Med Chem Lett 23: 3662-6 (2013)
Article DOI: 10.1016/j.bmcl.2013.02.083
BindingDB Entry DOI: 10.7270/Q2ST7R8C