null
SMILES: Cc1cccc(CSc2nnc(Cn3nnc4ccccc34)o2)c1
InChI Key: InChIKey=AJHXRNHRTLSBRH-UHFFFAOYSA-N
Activity Spreadsheet -- Enzyme Inhibition Constant Data from BindingDB
Found 1 hit for monomerid = 50435839
Trg + Lig
Ki
nM
ΔG°
kcal/mole
IC50
nM
Kd
nM
EC50/IC50
nM
koff
s-1
kon
M-1s-1
pHTemp
°C
Focal adhesion kinase 1
(Homo sapiens (Human))
BDBM50435839
(CHEMBL2393387)
Show SMILES Cc1cccc(CSc2nnc(Cn3nnc4ccccc34)o2)c1
Show InChI InChI=1S/C17H15N5OS/c1-12-5-4-6-13(9-12)11-24-17-20-19-16(23-17)10-22-15-8-3-2-7-14(15)18-21-22/h2-9H,10-11H2,1H3
NCI pathway
Reactome pathway
n/an/a 1.58E+4n/an/an/an/an/an/a
Nanjing University
Curated by ChEMBL
Assay Description
Inhibition of FAK assembly (unknown origin) after 20 mins by TRAP-PCR-ELISA
Bioorg Med Chem 21: 3723-9 (2013)
Article DOI: 10.1016/j.bmc.2013.04.043
BindingDB Entry DOI: 10.7270/Q2542PZ4