BDBM50435893 CHEMBL2391450
SMILES: COc1cccc(c1)C(=O)Nc1cc(C)nn(CC(=O)Nc2ccc(Br)cc2)c1=O
InChI Key: InChIKey=ZXZVORLKOGCNCE-UHFFFAOYSA-N
Data: 1 EC50
Activity Spreadsheet -- Enzyme Inhibition Constant Data from BindingDB
Found 1 hit for monomerid = 50435893
Trg + Lig
Ki
nM
ΔG°
kcal/mole
IC50
nM
Kd
nM
EC50/IC50
nM
koff
s-1
kon
M-1s-1
pHTemp
°C
FML2_HUMAN
(Homo sapiens (Human))
BDBM50435893
(CHEMBL2391450)
Show SMILES COc1cccc(c1)C(=O)Nc1cc(C)nn(CC(=O)Nc2ccc(Br)cc2)c1=O
Show InChI InChI=1S/C21H19BrN4O4/c1-13-10-18(24-20(28)14-4-3-5-17(11-14)30-2)21(29)26(25-13)12-19(27)23-16-8-6-15(22)7-9-16/h3-11H,12H2,1-2H3,(H,23,27)(H,24,28)
NCI pathway
Reactome pathway
n/an/an/an/a>5.00E+4n/an/an/an/a
Universit£ degli Studi di Firenze
Curated by ChEMBL
Assay Description
Agonist activity at FPR3 (unknown origin) transfected in human HL60 cells assessed as induction of Ca2+ mobilization
Eur J Med Chem 64: 512-28 (2013)
Article DOI: 10.1016/j.ejmech.2013.03.066
BindingDB Entry DOI: 10.7270/Q2N29ZBP