BDBM50435898 CHEMBL2391445
SMILES: Cc1ccc(=O)n(CC(=O)Nc2ccc(I)cc2)n1
InChI Key: InChIKey=NYESQGZOTNMZAB-UHFFFAOYSA-N
Data: 1 EC50
Activity Spreadsheet -- Enzyme Inhibition Constant Data from BindingDB
Found 1 hit for monomerid = 50435898
Trg + Lig
Ki
nM
ΔG°
kcal/mole
IC50
nM
Kd
nM
EC50/IC50
nM
koff
s-1
kon
M-1s-1
pHTemp
°C
N-formyl peptide receptor 3
(Homo sapiens (Human))
BDBM50435898
(CHEMBL2391445)
Show SMILES Cc1ccc(=O)n(CC(=O)Nc2ccc(I)cc2)n1
Show InChI InChI=1S/C13H12IN3O2/c1-9-2-7-13(19)17(16-9)8-12(18)15-11-5-3-10(14)4-6-11/h2-7H,8H2,1H3,(H,15,18)
NCI pathway
Reactome pathway
n/an/an/an/a>5.00E+4n/an/an/an/a
Universit£ degli Studi di Firenze
Curated by ChEMBL
Assay Description
Agonist activity at FPR3 (unknown origin) transfected in human HL60 cells assessed as induction of Ca2+ mobilization
Eur J Med Chem 64: 512-28 (2013)
Article DOI: 10.1016/j.ejmech.2013.03.066
BindingDB Entry DOI: 10.7270/Q2N29ZBP