BDBM50435910 CHEMBL2391282
SMILES: Cc1cc(Cc2cccc(Br)c2)c(=O)n(CC(=O)Nc2ccc(Br)cc2)n1
InChI Key: InChIKey=IPCAAUNXJQAOBP-UHFFFAOYSA-N
Data: 1 EC50
Activity Spreadsheet -- Enzyme Inhibition Constant Data from BindingDB
Found 1 hit for monomerid = 50435910
Trg + Lig
Ki
nM
ΔG°
kcal/mole
IC50
nM
Kd
nM
EC50/IC50
nM
koff
s-1
kon
M-1s-1
pHTemp
°C
FML2_HUMAN
(Homo sapiens (Human))
BDBM50435910
(CHEMBL2391282)
Show SMILES Cc1cc(Cc2cccc(Br)c2)c(=O)n(CC(=O)Nc2ccc(Br)cc2)n1
Show InChI InChI=1S/C20H17Br2N3O2/c1-13-9-15(10-14-3-2-4-17(22)11-14)20(27)25(24-13)12-19(26)23-18-7-5-16(21)6-8-18/h2-9,11H,10,12H2,1H3,(H,23,26)
NCI pathway
Reactome pathway
n/an/an/an/a>5.00E+4n/an/an/an/a
Universit£ degli Studi di Firenze
Curated by ChEMBL
Assay Description
Agonist activity at FPR3 (unknown origin) transfected in human HL60 cells assessed as induction of Ca2+ mobilization
Eur J Med Chem 64: 512-28 (2013)
Article DOI: 10.1016/j.ejmech.2013.03.066
BindingDB Entry DOI: 10.7270/Q2N29ZBP