BDBM50435923 CHEMBL2391269
SMILES: COc1cccc(Cc2cc(nn(CC(=O)Nc3ccc(F)cc3)c2=O)-c2ccc(Cl)cc2)c1
InChI Key: InChIKey=GQCTVNROIUWJCC-UHFFFAOYSA-N
Data: 1 EC50
Activity Spreadsheet -- Enzyme Inhibition Constant Data from BindingDB
Found 1 hit for monomerid = 50435923
Trg + Lig
Ki
nM
ΔG°
kcal/mole
IC50
nM
Kd
nM
EC50/IC50
nM
koff
s-1
kon
M-1s-1
pHTemp
°C
FML2_HUMAN
(Homo sapiens (Human))
BDBM50435923
(CHEMBL2391269)
Show SMILES COc1cccc(Cc2cc(nn(CC(=O)Nc3ccc(F)cc3)c2=O)-c2ccc(Cl)cc2)c1
Show InChI InChI=1S/C26H21ClFN3O3/c1-34-23-4-2-3-17(14-23)13-19-15-24(18-5-7-20(27)8-6-18)30-31(26(19)33)16-25(32)29-22-11-9-21(28)10-12-22/h2-12,14-15H,13,16H2,1H3,(H,29,32)
NCI pathway
Reactome pathway
n/an/an/an/a>5.00E+4n/an/an/an/a
Universit£ degli Studi di Firenze
Curated by ChEMBL
Assay Description
Agonist activity at FPR3 (unknown origin) transfected in human HL60 cells assessed as induction of Ca2+ mobilization
Eur J Med Chem 64: 512-28 (2013)
Article DOI: 10.1016/j.ejmech.2013.03.066
BindingDB Entry DOI: 10.7270/Q2N29ZBP