BDBM50435936 CHEMBL2391255
SMILES: CCc1cc(Cc2cccc(OC)c2)c(=O)n(CC(=O)Nc2ccc(I)cc2)n1
InChI Key: InChIKey=QPAXHVPVXIAMHT-UHFFFAOYSA-N
Data: 1 EC50
Activity Spreadsheet -- Enzyme Inhibition Constant Data from BindingDB
Found 1 hit for monomerid = 50435936
Trg + Lig
Ki
nM
ΔG°
kcal/mole
IC50
nM
Kd
nM
EC50/IC50
nM
koff
s-1
kon
M-1s-1
pHTemp
°C
FML2_HUMAN
(Homo sapiens (Human))
BDBM50435936
(CHEMBL2391255)
Show SMILES CCc1cc(Cc2cccc(OC)c2)c(=O)n(CC(=O)Nc2ccc(I)cc2)n1
Show InChI InChI=1S/C22H22IN3O3/c1-3-18-13-16(11-15-5-4-6-20(12-15)29-2)22(28)26(25-18)14-21(27)24-19-9-7-17(23)8-10-19/h4-10,12-13H,3,11,14H2,1-2H3,(H,24,27)
NCI pathway
Reactome pathway
n/an/an/an/a>5.00E+4n/an/an/an/a
Universit£ degli Studi di Firenze
Curated by ChEMBL
Assay Description
Agonist activity at FPR3 (unknown origin) transfected in human HL60 cells assessed as induction of Ca2+ mobilization
Eur J Med Chem 64: 512-28 (2013)
Article DOI: 10.1016/j.ejmech.2013.03.066
BindingDB Entry DOI: 10.7270/Q2N29ZBP