BDBM50436107 CHEMBL2397415
SMILES: CN1CCC(CC1)N1CCN(CC1)C(=O)[C@@H](Cc1cc(C)c2[nH]ncc2c1)NC(=O)N1CCC(CC1)c1cc2ccccc2[nH]c1=O
InChI Key: InChIKey=JJVAPHYEOZSKJZ-JGCGQSQUSA-N
Data: 1 KI  4 IC50
Activity Spreadsheet -- Enzyme Inhibition Constant Data from BindingDB
Found 5 hits for monomerid = 50436107
Trg + Lig
Ki
nM
ΔG°
kcal/mole
IC50
nM
Kd
nM
EC50/IC50
nM
koff
s-1
kon
M-1s-1
pHTemp
°C
Calcitonin gene-related peptide type 1 receptor
(Homo sapiens (Human))
BDBM50436107
(CHEMBL2397415)
Show SMILES CN1CCC(CC1)N1CCN(CC1)C(=O)[C@@H](Cc1cc(C)c2[nH]ncc2c1)NC(=O)N1CCC(CC1)c1cc2ccccc2[nH]c1=O |r|
Show InChI InChI=1S/C36H46N8O3/c1-24-19-25(20-28-23-37-40-33(24)28)21-32(35(46)43-17-15-42(16-18-43)29-9-11-41(2)12-10-29)39-36(47)44-13-7-26(8-14-44)30-22-27-5-3-4-6-31(27)38-34(30)45/h3-6,19-20,22-23,26,29,32H,7-18,21H2,1-2H3,(H,37,40)(H,38,45)(H,39,47)/t32-/m1/s1
Reactome pathway
0.0230n/an/an/an/an/an/an/an/a
Bristol-Myers Squibb R&D
Curated by ChEMBL
Assay Description
Displacement of [125I]-CGRP from CGRP receptor in human SK-N-MC cell membranes after 2 hrs by scintillation counting analysis
Bioorg Med Chem Lett 23: 3157-61 (2013)
Article DOI: 10.1016/j.bmcl.2013.04.012
BindingDB Entry DOI: 10.7270/Q2348MSQ
Cytochrome P450 2D6
(Homo sapiens (Human))
BDBM50436107
(CHEMBL2397415)
Show SMILES CN1CCC(CC1)N1CCN(CC1)C(=O)[C@@H](Cc1cc(C)c2[nH]ncc2c1)NC(=O)N1CCC(CC1)c1cc2ccccc2[nH]c1=O |r|
Show InChI InChI=1S/C36H46N8O3/c1-24-19-25(20-28-23-37-40-33(24)28)21-32(35(46)43-17-15-42(16-18-43)29-9-11-41(2)12-10-29)39-36(47)44-13-7-26(8-14-44)30-22-27-5-3-4-6-31(27)38-34(30)45/h3-6,19-20,22-23,26,29,32H,7-18,21H2,1-2H3,(H,37,40)(H,38,45)(H,39,47)/t32-/m1/s1
n/an/a>4.00E+4n/an/an/an/an/an/a
Bristol-Myers Squibb R&D
Curated by ChEMBL
Assay Description
Inhibition of CYP2D6 (unknown origin) expressed in baculovirus-infected insect cell microsomes assessed as 3-[2-(N,N-diethyl-N-methylamino)ethyl]-7-m...
Bioorg Med Chem Lett 23: 3157-61 (2013)
Article DOI: 10.1016/j.bmcl.2013.04.012
BindingDB Entry DOI: 10.7270/Q2348MSQ
Cytochrome P450 2C9
(Homo sapiens (Human))
BDBM50436107
(CHEMBL2397415)
Show SMILES CN1CCC(CC1)N1CCN(CC1)C(=O)[C@@H](Cc1cc(C)c2[nH]ncc2c1)NC(=O)N1CCC(CC1)c1cc2ccccc2[nH]c1=O |r|
Show InChI InChI=1S/C36H46N8O3/c1-24-19-25(20-28-23-37-40-33(24)28)21-32(35(46)43-17-15-42(16-18-43)29-9-11-41(2)12-10-29)39-36(47)44-13-7-26(8-14-44)30-22-27-5-3-4-6-31(27)38-34(30)45/h3-6,19-20,22-23,26,29,32H,7-18,21H2,1-2H3,(H,37,40)(H,38,45)(H,39,47)/t32-/m1/s1
Reactome pathway
n/an/a>4.00E+4n/an/an/an/an/an/a
Bristol-Myers Squibb R&D
Curated by ChEMBL
Assay Description
Inhibition of CYP2C9 (unknown origin) expressed in baculovirus-infected insect cell microsomes assessed as 7-methoxy-4-trifluoromethylcoumarin conver...
Bioorg Med Chem Lett 23: 3157-61 (2013)
Article DOI: 10.1016/j.bmcl.2013.04.012
BindingDB Entry DOI: 10.7270/Q2348MSQ
Cytochrome P450 1A
(Homo sapiens (Human))
BDBM50436107
(CHEMBL2397415)
Show SMILES CN1CCC(CC1)N1CCN(CC1)C(=O)[C@@H](Cc1cc(C)c2[nH]ncc2c1)NC(=O)N1CCC(CC1)c1cc2ccccc2[nH]c1=O |r|
Show InChI InChI=1S/C36H46N8O3/c1-24-19-25(20-28-23-37-40-33(24)28)21-32(35(46)43-17-15-42(16-18-43)29-9-11-41(2)12-10-29)39-36(47)44-13-7-26(8-14-44)30-22-27-5-3-4-6-31(27)38-34(30)45/h3-6,19-20,22-23,26,29,32H,7-18,21H2,1-2H3,(H,37,40)(H,38,45)(H,39,47)/t32-/m1/s1
Reactome pathway
n/an/a>4.00E+4n/an/an/an/an/an/a
Bristol-Myers Squibb R&D
Curated by ChEMBL
Assay Description
Inhibition of CYP1A2 (unknown origin) expressed in baculovirus-infected insect cell microsomes assessed as 3-cyano-7-ethoxycoumarin conversion to 7-h...
Bioorg Med Chem Lett 23: 3157-61 (2013)
Article DOI: 10.1016/j.bmcl.2013.04.012
BindingDB Entry DOI: 10.7270/Q2348MSQ
Cytochrome P450 2C19
(Homo sapiens (Human))
BDBM50436107
(CHEMBL2397415)
Show SMILES CN1CCC(CC1)N1CCN(CC1)C(=O)[C@@H](Cc1cc(C)c2[nH]ncc2c1)NC(=O)N1CCC(CC1)c1cc2ccccc2[nH]c1=O |r|
Show InChI InChI=1S/C36H46N8O3/c1-24-19-25(20-28-23-37-40-33(24)28)21-32(35(46)43-17-15-42(16-18-43)29-9-11-41(2)12-10-29)39-36(47)44-13-7-26(8-14-44)30-22-27-5-3-4-6-31(27)38-34(30)45/h3-6,19-20,22-23,26,29,32H,7-18,21H2,1-2H3,(H,37,40)(H,38,45)(H,39,47)/t32-/m1/s1
Reactome pathway
n/an/a>4.00E+4n/an/an/an/an/an/a
Bristol-Myers Squibb R&D
Curated by ChEMBL
Assay Description
Inhibition of CYP2C19 (unknown origin) expressed in baculovirus-infected insect cell microsomes assessed as 3-cyano-7-ethoxycoumarin conversion to 7-...
Bioorg Med Chem Lett 23: 3157-61 (2013)
Article DOI: 10.1016/j.bmcl.2013.04.012
BindingDB Entry DOI: 10.7270/Q2348MSQ