BDBM50436225 CHEMBL2398689
SMILES: Cc1nc(no1)-c1cccc(c1)C(=O)N1CCCC(C1)C(=O)Nc1ccc(Cl)cc1
InChI Key: InChIKey=ZVXAXLBXZOUNJB-UHFFFAOYSA-N
Data: 1 IC50
Activity Spreadsheet -- Enzyme Inhibition Constant Data from BindingDB
Found 1 hit for monomerid = 50436225
Trg + Lig
Ki
nM
ΔG°
kcal/mole
IC50
nM
Kd
nM
EC50/IC50
nM
koff
s-1
kon
M-1s-1
pHTemp
°C
Transforming protein RhoA
(Homo sapiens (Human))
BDBM50436225
(CHEMBL2398689)
Show SMILES Cc1nc(no1)-c1cccc(c1)C(=O)N1CCCC(C1)C(=O)Nc1ccc(Cl)cc1
Show InChI InChI=1S/C22H21ClN4O3/c1-14-24-20(26-30-14)15-4-2-5-16(12-15)22(29)27-11-3-6-17(13-27)21(28)25-19-9-7-18(23)8-10-19/h2,4-5,7-10,12,17H,3,6,11,13H2,1H3,(H,25,28)
Reactome pathway
n/an/a 7.80E+4n/an/an/an/an/an/a
College of Pharmacy
Curated by ChEMBL
Assay Description
Inhibition of RhoC-mediated pathway in human PC3 cells assessed as inhibition of SRE-regulated gene transcription by luciferase reporter gene assay
Bioorg Med Chem Lett 23: 3826-32 (2013)
Article DOI: 10.1016/j.bmcl.2013.04.080
BindingDB Entry DOI: 10.7270/Q28P61XS