BDBM50436232 CHEMBL2398682
SMILES: Clc1ccc(NC(=O)C2CCCN(C2)C(=O)c2cccc(C=C)c2)cc1
InChI Key: InChIKey=ZOXRGDBGFKQBHU-UHFFFAOYSA-N
Data: 1 IC50
Activity Spreadsheet -- Enzyme Inhibition Constant Data from BindingDB
Found 1 hit for monomerid = 50436232
Trg + Lig
Ki
nM
ΔG°
kcal/mole
IC50
nM
Kd
nM
EC50/IC50
nM
koff
s-1
kon
M-1s-1
pHTemp
°C
Transforming protein RhoA
(Homo sapiens (Human))
BDBM50436232
(CHEMBL2398682)
Show SMILES Clc1ccc(NC(=O)C2CCCN(C2)C(=O)c2cccc(C=C)c2)cc1
Show InChI InChI=1S/C21H21ClN2O2/c1-2-15-5-3-6-16(13-15)21(26)24-12-4-7-17(14-24)20(25)23-19-10-8-18(22)9-11-19/h2-3,5-6,8-11,13,17H,1,4,7,12,14H2,(H,23,25)
Reactome pathway
n/an/a 3.30E+4n/an/an/an/an/an/a
College of Pharmacy
Curated by ChEMBL
Assay Description
Inhibition of RhoC-mediated pathway in human PC3 cells assessed as inhibition of SRE-regulated gene transcription by luciferase reporter gene assay
Bioorg Med Chem Lett 23: 3826-32 (2013)
Article DOI: 10.1016/j.bmcl.2013.04.080
BindingDB Entry DOI: 10.7270/Q28P61XS