BDBM50436237 CHEMBL603141
SMILES: FC(F)(F)c1cc(cc(c1)C(F)(F)F)C(=O)N1CCCC(C1)C(=O)Nc1ccc(Cl)cc1
InChI Key: InChIKey=MOQCFMZWVKQBAP-UHFFFAOYSA-N
Data: 2 IC50
Activity Spreadsheet -- Enzyme Inhibition Constant Data from BindingDB
Found 2 hits for monomerid = 50436237
Trg + Lig
Ki
nM
ΔG°
kcal/mole
IC50
nM
Kd
nM
EC50/IC50
nM
koff
s-1
kon
M-1s-1
pHTemp
°C
Rho-related GTP-binding protein RhoC
(Homo sapiens)
BDBM50436237
(CHEMBL603141)
Show SMILES FC(F)(F)c1cc(cc(c1)C(F)(F)F)C(=O)N1CCCC(C1)C(=O)Nc1ccc(Cl)cc1
Show InChI InChI=1S/C21H17ClF6N2O2/c22-16-3-5-17(6-4-16)29-18(31)12-2-1-7-30(11-12)19(32)13-8-14(20(23,24)25)10-15(9-13)21(26,27)28/h3-6,8-10,12H,1-2,7,11H2,(H,29,31)
n/an/a 9.80E+3n/an/an/an/an/an/a
University of Michigan Medical School
Curated by ChEMBL
Assay Description
Inhibition of RhoA/C-mediated transcriptional response in human PC3 cells by serum response factor-luciferase reporter gene assay
Bioorg Med Chem Lett 20: 665-72 (2010)
Article DOI: 10.1016/j.bmcl.2009.11.056
BindingDB Entry DOI: 10.7270/Q29S1TTD
Transforming protein RhoA
(Homo sapiens (Human))
BDBM50436237
(CHEMBL603141)
Show SMILES FC(F)(F)c1cc(cc(c1)C(F)(F)F)C(=O)N1CCCC(C1)C(=O)Nc1ccc(Cl)cc1
Show InChI InChI=1S/C21H17ClF6N2O2/c22-16-3-5-17(6-4-16)29-18(31)12-2-1-7-30(11-12)19(32)13-8-14(20(23,24)25)10-15(9-13)21(26,27)28/h3-6,8-10,12H,1-2,7,11H2,(H,29,31)
Reactome pathway
n/an/a 9.80E+3n/an/an/an/an/an/a
College of Pharmacy
Curated by ChEMBL
Assay Description
Inhibition of RhoC-mediated pathway in human PC3 cells assessed as inhibition of SRE-regulated gene transcription by luciferase reporter gene assay
Bioorg Med Chem Lett 23: 3826-32 (2013)
Article DOI: 10.1016/j.bmcl.2013.04.080
BindingDB Entry DOI: 10.7270/Q28P61XS