BDBM50436242 CHEMBL2398671
SMILES: FC(F)(F)c1cc(cc(c1)C(F)(F)F)C(=O)N1CCCC(C1)C(=O)Nc1cccc(c1)-c1ccco1
InChI Key: InChIKey=KEOBJHDLTRGAIN-UHFFFAOYSA-N
Data: 1 IC50
Activity Spreadsheet -- Enzyme Inhibition Constant Data from BindingDB
Found 1 hit for monomerid = 50436242
Trg + Lig
Ki
nM
ΔG°
kcal/mole
IC50
nM
Kd
nM
EC50/IC50
nM
koff
s-1
kon
M-1s-1
pHTemp
°C
Transforming protein RhoA
(Homo sapiens (Human))
BDBM50436242
(CHEMBL2398671)
Show SMILES FC(F)(F)c1cc(cc(c1)C(F)(F)F)C(=O)N1CCCC(C1)C(=O)Nc1cccc(c1)-c1ccco1
Show InChI InChI=1S/C25H20F6N2O3/c26-24(27,28)18-10-17(11-19(13-18)25(29,30)31)23(35)33-8-2-5-16(14-33)22(34)32-20-6-1-4-15(12-20)21-7-3-9-36-21/h1,3-4,6-7,9-13,16H,2,5,8,14H2,(H,32,34)
Reactome pathway
n/an/a 2.10E+4n/an/an/an/an/an/a
College of Pharmacy
Curated by ChEMBL
Assay Description
Inhibition of RhoC-mediated pathway in human PC3 cells assessed as inhibition of SRE-regulated gene transcription by luciferase reporter gene assay
Bioorg Med Chem Lett 23: 3826-32 (2013)
Article DOI: 10.1016/j.bmcl.2013.04.080
BindingDB Entry DOI: 10.7270/Q28P61XS