BDBM50436254 CHEMBL2398702
SMILES: CCc1cccc(NC(=O)C2CCCN(C2)C(=O)c2cc(cc(c2)C(F)(F)F)C(F)(F)F)c1
InChI Key: InChIKey=WDQLQDWWQIQYKE-UHFFFAOYSA-N
Data: 1 IC50
Activity Spreadsheet -- Enzyme Inhibition Constant Data from BindingDB
Found 1 hit for monomerid = 50436254
Trg + Lig
Ki
nM
ΔG°
kcal/mole
IC50
nM
Kd
nM
EC50/IC50
nM
koff
s-1
kon
M-1s-1
pHTemp
°C
Transforming protein RhoA
(Homo sapiens (Human))
BDBM50436254
(CHEMBL2398702)
Show SMILES CCc1cccc(NC(=O)C2CCCN(C2)C(=O)c2cc(cc(c2)C(F)(F)F)C(F)(F)F)c1
Show InChI InChI=1S/C23H22F6N2O2/c1-2-14-5-3-7-19(9-14)30-20(32)15-6-4-8-31(13-15)21(33)16-10-17(22(24,25)26)12-18(11-16)23(27,28)29/h3,5,7,9-12,15H,2,4,6,8,13H2,1H3,(H,30,32)
Reactome pathway
n/an/a 8.10E+3n/an/an/an/an/an/a
College of Pharmacy
Curated by ChEMBL
Assay Description
Inhibition of RhoC-mediated pathway in human PC3 cells assessed as inhibition of SRE-regulated gene transcription by luciferase reporter gene assay
Bioorg Med Chem Lett 23: 3826-32 (2013)
Article DOI: 10.1016/j.bmcl.2013.04.080
BindingDB Entry DOI: 10.7270/Q28P61XS