BDBM50436255 CHEMBL2398701
SMILES: Cc1nc(cs1)-c1cccc(NC(=O)C2CCCN(C2)C(=O)c2cc(cc(c2)C(F)(F)F)C(F)(F)F)c1
InChI Key: InChIKey=YSSHRHDTIRCHTH-UHFFFAOYSA-N
Data: 1 IC50
Activity Spreadsheet -- Enzyme Inhibition Constant Data from BindingDB
Found 1 hit for monomerid = 50436255
Trg + Lig
Ki
nM
ΔG°
kcal/mole
IC50
nM
Kd
nM
EC50/IC50
nM
koff
s-1
kon
M-1s-1
pHTemp
°C
Transforming protein RhoA
(Homo sapiens (Human))
BDBM50436255
(CHEMBL2398701)
Show SMILES Cc1nc(cs1)-c1cccc(NC(=O)C2CCCN(C2)C(=O)c2cc(cc(c2)C(F)(F)F)C(F)(F)F)c1
Show InChI InChI=1S/C25H21F6N3O2S/c1-14-32-21(13-37-14)15-4-2-6-20(10-15)33-22(35)16-5-3-7-34(12-16)23(36)17-8-18(24(26,27)28)11-19(9-17)25(29,30)31/h2,4,6,8-11,13,16H,3,5,7,12H2,1H3,(H,33,35)
Reactome pathway
n/an/a 6.10E+3n/an/an/an/an/an/a
College of Pharmacy
Curated by ChEMBL
Assay Description
Inhibition of RhoC-mediated pathway in human PC3 cells assessed as inhibition of SRE-regulated gene transcription by luciferase reporter gene assay
Bioorg Med Chem Lett 23: 3826-32 (2013)
Article DOI: 10.1016/j.bmcl.2013.04.080
BindingDB Entry DOI: 10.7270/Q28P61XS