BDBM50436284 CHEMBL2398747::US8633226, 460
SMILES: CC(C)[C@@H](NC(=O)C1CCCC1)C(=O)N1CC[C@](O)(c2ccc(Cl)cc2)C(C)(C)C1
InChI Key: InChIKey=UTGYFIZUYRNNRM-YKSBVNFPSA-N
Data: 1 KI  2 IC50
Activity Spreadsheet -- Enzyme Inhibition Constant Data from BindingDB
Found 3 hits for monomerid = 50436284
Trg + Lig
Ki
nM
ΔG°
kcal/mole
IC50
nM
Kd
nM
EC50/IC50
nM
koff
s-1
kon
M-1s-1
pHTemp
°C
C-C chemokine receptor type 1
(Homo sapiens (Human))
BDBM50436284
(CHEMBL2398747 | US8633226, 460)
Show SMILES CC(C)[C@@H](NC(=O)C1CCCC1)C(=O)N1CC[C@](O)(c2ccc(Cl)cc2)C(C)(C)C1 |r|
Show InChI InChI=1S/C24H35ClN2O3/c1-16(2)20(26-21(28)17-7-5-6-8-17)22(29)27-14-13-24(30,23(3,4)15-27)18-9-11-19(25)12-10-18/h9-12,16-17,20,30H,5-8,13-15H2,1-4H3,(H,26,28)/t20-,24+/m1/s1
Reactome pathway
US Patent
0.700 -12.5n/an/an/an/an/an/a25
Bristol-Myers Squibb Company
US Patent
Assay Description
For radioligand competition studies, a final concentration of 1x105 THP-1 monocytic leukemia cells are combined with 100 μg of LS WGA PS beads (...
US Patent US8633226 (2014)
BindingDB Entry DOI: 10.7270/Q22J69HG
C-C chemokine receptor type 1
(Homo sapiens (Human))
BDBM50436284
(CHEMBL2398747 | US8633226, 460)
Show SMILES CC(C)[C@@H](NC(=O)C1CCCC1)C(=O)N1CC[C@](O)(c2ccc(Cl)cc2)C(C)(C)C1 |r|
Show InChI InChI=1S/C24H35ClN2O3/c1-16(2)20(26-21(28)17-7-5-6-8-17)22(29)27-14-13-24(30,23(3,4)15-27)18-9-11-19(25)12-10-18/h9-12,16-17,20,30H,5-8,13-15H2,1-4H3,(H,26,28)/t20-,24+/m1/s1
Reactome pathway
n/an/a 1.40n/an/an/an/an/an/a
Bristol-Myers Squibb Company
Curated by ChEMBL
Assay Description
Binding affinity to human CCR1
Bioorg Med Chem Lett 23: 3833-40 (2013)
Article DOI: 10.1016/j.bmcl.2013.04.079
BindingDB Entry DOI: 10.7270/Q24X596G
C-C chemokine receptor type 1
(Homo sapiens (Human))
BDBM50436284
(CHEMBL2398747 | US8633226, 460)
Show SMILES CC(C)[C@@H](NC(=O)C1CCCC1)C(=O)N1CC[C@](O)(c2ccc(Cl)cc2)C(C)(C)C1 |r|
Show InChI InChI=1S/C24H35ClN2O3/c1-16(2)20(26-21(28)17-7-5-6-8-17)22(29)27-14-13-24(30,23(3,4)15-27)18-9-11-19(25)12-10-18/h9-12,16-17,20,30H,5-8,13-15H2,1-4H3,(H,26,28)/t20-,24+/m1/s1
Reactome pathway
n/an/a 2.5n/an/an/an/an/an/a
Bristol-Myers Squibb Company
Curated by ChEMBL
Assay Description
Antagonist activity at human CCR1 assessed as inhibition of MIP1alpha-induced chemotaxis
Bioorg Med Chem Lett 23: 3833-40 (2013)
Article DOI: 10.1016/j.bmcl.2013.04.079
BindingDB Entry DOI: 10.7270/Q24X596G