BDBM50437040 CHEMBL2403065
SMILES: CN1CCN(CC1)c1ccc(Nc2ncc(Cl)c(n2)-c2cccc(CC#N)c2)cc1F
InChI Key: InChIKey=HJDWTGMIRQXKFE-UHFFFAOYSA-N
Data: 1 IC50  1 EC50
Activity Spreadsheet -- Enzyme Inhibition Constant Data from BindingDB
Found 2 hits for monomerid = 50437040
Trg + Lig
Ki
nM
ΔG°
kcal/mole
IC50
nM
Kd
nM
EC50/IC50
nM
koff
s-1
kon
M-1s-1
pHTemp
°C
PAK 1/CDC42
(Homo sapiens (Human))
BDBM50437040
(CHEMBL2403065)
Show SMILES CN1CCN(CC1)c1ccc(Nc2ncc(Cl)c(n2)-c2cccc(CC#N)c2)cc1F
Show InChI InChI=1S/C23H22ClFN6/c1-30-9-11-31(12-10-30)21-6-5-18(14-20(21)25)28-23-27-15-19(24)22(29-23)17-4-2-3-16(13-17)7-8-26/h2-6,13-15H,7,9-12H2,1H3,(H,27,28,29)
n/an/a 548n/an/an/an/an/an/a
Astex Pharmaceuticals, Inc.
Curated by ChEMBL
Assay Description
Inhibition of human recombinant PAK1 using MBP as substrate by scintillation counting analysis in presence of [gamma-32P]ATP
Bioorg Med Chem Lett 23: 4072-5 (2013)
Article DOI: 10.1016/j.bmcl.2013.05.059
BindingDB Entry DOI: 10.7270/Q25M674B
PAK 1/CDC42
(Homo sapiens (Human))
BDBM50437040
(CHEMBL2403065)
Show SMILES CN1CCN(CC1)c1ccc(Nc2ncc(Cl)c(n2)-c2cccc(CC#N)c2)cc1F
Show InChI InChI=1S/C23H22ClFN6/c1-30-9-11-31(12-10-30)21-6-5-18(14-20(21)25)28-23-27-15-19(24)22(29-23)17-4-2-3-16(13-17)7-8-26/h2-6,13-15H,7,9-12H2,1H3,(H,27,28,29)
n/an/an/an/a 1.76E+4n/an/an/an/a
Astex Pharmaceuticals, Inc.
Curated by ChEMBL
Assay Description
Inhibition of PAK1 in human OVCAR3 cells assessed as MEK phosphorylation by TR-FRET assay
Bioorg Med Chem Lett 23: 4072-5 (2013)
Article DOI: 10.1016/j.bmcl.2013.05.059
BindingDB Entry DOI: 10.7270/Q25M674B