BDBM50437221 CHEMBL2402917
SMILES: CS(=O)(=O)c1cccc(c1)-c1cc(OC(=O)NC2CCCCC2)ccc1O
InChI Key: InChIKey=GHLAEWIYLBSWQU-UHFFFAOYSA-N
Data: 1 IC50
Activity Spreadsheet -- Enzyme Inhibition Constant Data from BindingDB
Found 1 hit for monomerid = 50437221
Trg + Lig
Ki
nM
ΔG°
kcal/mole
IC50
nM
Kd
nM
EC50/IC50
nM
koff
s-1
kon
M-1s-1
pHTemp
°C
Fatty-acid amide hydrolase 1 (aa 30-579)
(Rattus norvegicus (rat))
BDBM50437221
(CHEMBL2402917)
Show SMILES CS(=O)(=O)c1cccc(c1)-c1cc(OC(=O)NC2CCCCC2)ccc1O
Show InChI InChI=1S/C20H23NO5S/c1-27(24,25)17-9-5-6-14(12-17)18-13-16(10-11-19(18)22)26-20(23)21-15-7-3-2-4-8-15/h5-6,9-13,15,22H,2-4,7-8H2,1H3,(H,21,23)
n/an/a 6.30n/an/an/an/an/an/a
Fondazione Istituto Italiano di Tecnologia
Curated by ChEMBL
Assay Description
Inhibition of Wistar rat brain FAAH using [3H]-ethanolamine as substrate preincubated for 20 mins followed by substrate addition by liquid scintillat...
J Med Chem 56: 5917-30 (2014)
Article DOI: 10.1021/jm4007017
BindingDB Entry DOI: 10.7270/Q2KP83KP