BDBM50437226 CHEMBL2402919
SMILES: CC(O)c1cccc(c1)-c1cc(OC(=O)NC2CCCCC2)ccc1O
InChI Key: InChIKey=BCHNIYXXBVTMRH-UHFFFAOYSA-N
Data: 1 IC50
Activity Spreadsheet -- Enzyme Inhibition Constant Data from BindingDB
Found 1 hit for monomerid = 50437226
Trg + Lig
Ki
nM
ΔG°
kcal/mole
IC50
nM
Kd
nM
EC50/IC50
nM
koff
s-1
kon
M-1s-1
pHTemp
°C
Fatty-acid amide hydrolase 1 (aa 30-579)
(Rattus norvegicus (rat))
BDBM50437226
(CHEMBL2402919)
Show SMILES CC(O)c1cccc(c1)-c1cc(OC(=O)NC2CCCCC2)ccc1O
Show InChI InChI=1S/C21H25NO4/c1-14(23)15-6-5-7-16(12-15)19-13-18(10-11-20(19)24)26-21(25)22-17-8-3-2-4-9-17/h5-7,10-14,17,23-24H,2-4,8-9H2,1H3,(H,22,25)
n/an/a 2n/an/an/an/an/an/a
Fondazione Istituto Italiano di Tecnologia
Curated by ChEMBL
Assay Description
Inhibition of Wistar rat brain FAAH using [3H]-ethanolamine as substrate preincubated for 20 mins followed by substrate addition by liquid scintillat...
J Med Chem 56: 5917-30 (2014)
Article DOI: 10.1021/jm4007017
BindingDB Entry DOI: 10.7270/Q2KP83KP