BDBM50437434 CHEMBL2409175
SMILES: CC(=O)Nc1cc(Nc2cc(NC3CC3)n3ncc(C#N)c3n2)ccc1C
InChI Key: InChIKey=GDSQVLMYYCNAGP-UHFFFAOYSA-N
Data: 5 IC50  1 Kd
PDB links: 1 PDB ID matches this monomer.
Activity Spreadsheet -- Enzyme Inhibition Constant Data from BindingDB
Found 6 hits for monomerid = 50437434
Trg + Lig
Ki
nM
ΔG°
kcal/mole
IC50
nM
Kd
nM
EC50/IC50
nM
koff
s-1
kon
M-1s-1
pHTemp
°C
Serine/threonine-protein kinase pim-3
(Homo sapiens (Human))
BDBM50437434
(CHEMBL2409175)
Show SMILES CC(=O)Nc1cc(Nc2cc(NC3CC3)n3ncc(C#N)c3n2)ccc1C
Show InChI InChI=1S/C19H19N7O/c1-11-3-4-15(7-16(11)22-12(2)27)23-17-8-18(24-14-5-6-14)26-19(25-17)13(9-20)10-21-26/h3-4,7-8,10,14,24H,5-6H2,1-2H3,(H,22,27)(H,23,25)
n/an/a 150n/an/an/an/an/an/a
AstraZeneca
Curated by ChEMBL
Assay Description
Inhibition of PIM3 (unknown origin)
ACS Med Chem Lett 4: 800-5 (2013)
Article DOI: 10.1021/ml400197u
BindingDB Entry DOI: 10.7270/Q20R9QT2
Dual-specificity tyrosine-phosphorylation regulated kinase 3
(Homo sapiens (Human))
BDBM50437434
(CHEMBL2409175)
Show SMILES CC(=O)Nc1cc(Nc2cc(NC3CC3)n3ncc(C#N)c3n2)ccc1C
Show InChI InChI=1S/C19H19N7O/c1-11-3-4-15(7-16(11)22-12(2)27)23-17-8-18(24-14-5-6-14)26-19(25-17)13(9-20)10-21-26/h3-4,7-8,10,14,24H,5-6H2,1-2H3,(H,22,27)(H,23,25)
n/an/a 70n/an/an/an/an/an/a
AstraZeneca
Curated by ChEMBL
Assay Description
Inhibition of Dyrk-3 (unknown origin)
ACS Med Chem Lett 4: 800-5 (2013)
Article DOI: 10.1021/ml400197u
BindingDB Entry DOI: 10.7270/Q20R9QT2
Casein kinase II subunit alpha
(Homo sapiens (Human))
BDBM50437434
(CHEMBL2409175)
Show SMILES CC(=O)Nc1cc(Nc2cc(NC3CC3)n3ncc(C#N)c3n2)ccc1C
Show InChI InChI=1S/C19H19N7O/c1-11-3-4-15(7-16(11)22-12(2)27)23-17-8-18(24-14-5-6-14)26-19(25-17)13(9-20)10-21-26/h3-4,7-8,10,14,24H,5-6H2,1-2H3,(H,22,27)(H,23,25)
n/an/a<3n/an/an/an/an/an/a
AstraZeneca
Curated by ChEMBL
Assay Description
Inhibition of recombinant human full length N-terminal His6-tagged CK2alpha expressed in Sf21 insect cells using CK2tide as substrate treated for 20 ...
Bioorg Med Chem Lett 28: 1336-1341 (2018)
Article DOI: 10.1016/j.bmcl.2018.03.018
BindingDB Entry DOI: 10.7270/Q2DB84H6
3D
3D Structure (crystal)
Casein kinase II subunit alpha
(Homo sapiens (Human))
BDBM50437434
(CHEMBL2409175)
Show SMILES CC(=O)Nc1cc(Nc2cc(NC3CC3)n3ncc(C#N)c3n2)ccc1C
Show InChI InChI=1S/C19H19N7O/c1-11-3-4-15(7-16(11)22-12(2)27)23-17-8-18(24-14-5-6-14)26-19(25-17)13(9-20)10-21-26/h3-4,7-8,10,14,24H,5-6H2,1-2H3,(H,22,27)(H,23,25)
n/an/a<3n/an/an/an/an/an/a
AstraZeneca
Curated by ChEMBL
Assay Description
Inhibition of full length N-terminal 6xHis-tagged recombinant human CK2alpha expressed in fall armyworm Sf21 cells using BODIPY-FL-RRRDDDSDDD-CONH2 a...
ACS Med Chem Lett 7: 300-5 (2016)
BindingDB Entry DOI: 10.7270/Q2C53NRM
3D
3D Structure (crystal)
Casein kinase II subunit alpha
(Homo sapiens (Human))
BDBM50437434
(CHEMBL2409175)
Show SMILES CC(=O)Nc1cc(Nc2cc(NC3CC3)n3ncc(C#N)c3n2)ccc1C
Show InChI InChI=1S/C19H19N7O/c1-11-3-4-15(7-16(11)22-12(2)27)23-17-8-18(24-14-5-6-14)26-19(25-17)13(9-20)10-21-26/h3-4,7-8,10,14,24H,5-6H2,1-2H3,(H,22,27)(H,23,25)
n/an/an/a 4.90n/an/an/an/an/a
AstraZeneca
Curated by ChEMBL
Assay Description
Binding affinity to His-tagged recombinant human CK2alpha (6 to 335 residues) after 50 to 116.7 mins by surface plasmon resonance assay
ACS Med Chem Lett 7: 300-5 (2016)
BindingDB Entry DOI: 10.7270/Q2C53NRM
3D
3D Structure (crystal)
Homeodomain-interacting protein kinase 2 (HIPK2)
(Homo sapiens (Human))
BDBM50437434
(CHEMBL2409175)
Show SMILES CC(=O)Nc1cc(Nc2cc(NC3CC3)n3ncc(C#N)c3n2)ccc1C
Show InChI InChI=1S/C19H19N7O/c1-11-3-4-15(7-16(11)22-12(2)27)23-17-8-18(24-14-5-6-14)26-19(25-17)13(9-20)10-21-26/h3-4,7-8,10,14,24H,5-6H2,1-2H3,(H,22,27)(H,23,25)
Reactome pathway
n/an/a 40n/an/an/an/an/an/a
AstraZeneca
Curated by ChEMBL
Assay Description
Inhibition of Hipk-2 (unknown origin)
ACS Med Chem Lett 4: 800-5 (2013)
Article DOI: 10.1021/ml400197u
BindingDB Entry DOI: 10.7270/Q20R9QT2