BDBM50437435 CHEMBL2409173
SMILES: CC(=O)N1CCc2ccc(Nc3cc(NC4CC4)n4ncc(C#N)c4n3)cc12
InChI Key: InChIKey=XZCGHATYECEONP-UHFFFAOYSA-N
Data: 1 IC50
Activity Spreadsheet -- Enzyme Inhibition Constant Data from BindingDB
Found 1 hit for monomerid = 50437435
Trg + Lig
Ki
nM
ΔG°
kcal/mole
IC50
nM
Kd
nM
EC50/IC50
nM
koff
s-1
kon
M-1s-1
pHTemp
°C
Casein kinase II subunit alpha
(Homo sapiens (Human))
BDBM50437435
(CHEMBL2409173)
Show SMILES CC(=O)N1CCc2ccc(Nc3cc(NC4CC4)n4ncc(C#N)c4n3)cc12
Show InChI InChI=1S/C20H19N7O/c1-12(28)26-7-6-13-2-3-16(8-17(13)26)23-18-9-19(24-15-4-5-15)27-20(25-18)14(10-21)11-22-27/h2-3,8-9,11,15,24H,4-7H2,1H3,(H,23,25)
n/an/a 6n/an/an/an/an/an/a
AstraZeneca
Curated by ChEMBL
Assay Description
Inhibition of N-terminal His6X-tagged recombinant human full length casein kinase-2alpha expressed in SF21 cells using BODIPY-FL-RRRDDDSDDD-CONH2 as ...
ACS Med Chem Lett 4: 800-5 (2013)
Article DOI: 10.1021/ml400197u
BindingDB Entry DOI: 10.7270/Q20R9QT2