BDBM50437466 CHEMBL2409355
SMILES: Oc1cc(OCC(=O)OCCO[N+]([O-])=O)cc2oc(cc(=O)c12)-c1ccc2OCCOc2c1
InChI Key: InChIKey=OQRSILUAVKQWCS-UHFFFAOYSA-N
Data: 1 IC50
Activity Spreadsheet -- Enzyme Inhibition Constant Data from BindingDB
Found 1 hit for monomerid = 50437466
Trg + Lig
Ki
nM
ΔG°
kcal/mole
IC50
nM
Kd
nM
EC50/IC50
nM
koff
s-1
kon
M-1s-1
pHTemp
°C
Aldose reductase (ALR2)
(Bos taurus (Cattle))
BDBM50437466
(CHEMBL2409355)
Show SMILES Oc1cc(OCC(=O)OCCO[N+]([O-])=O)cc2oc(cc(=O)c12)-c1ccc2OCCOc2c1
Show InChI InChI=1S/C21H17NO11/c23-14-8-13(31-11-20(25)30-5-6-32-22(26)27)9-19-21(14)15(24)10-17(33-19)12-1-2-16-18(7-12)29-4-3-28-16/h1-2,7-10,23H,3-6,11H2
n/an/a 445n/an/an/an/an/an/a
Xiangtan University
Curated by ChEMBL
Assay Description
Inhibition of bovine lens aldose reductase using DL-glyceraldehyde as substrate assessed as NADPH oxidation measured for 10 mins by spectrophotometri...
Bioorg Med Chem 21: 4301-10 (2013)
Article DOI: 10.1016/j.bmc.2013.04.066
BindingDB Entry DOI: 10.7270/Q2BZ67GT