BDBM50437471 CHEMBL2409489
SMILES: C[C@@H]1C[C@H]1C(=O)N1CC2CNCC(C2)C1
InChI Key: InChIKey=KPHRNXIFUJLFNL-AGVGLQIMSA-N
Data: 2 KI  1 EC50
Activity Spreadsheet -- Enzyme Inhibition Constant Data from BindingDB
Found 3 hits for monomerid = 50437471
Trg + Lig
Ki
nM
ΔG°
kcal/mole
IC50
nM
Kd
nM
EC50/IC50
nM
koff
s-1
kon
M-1s-1
pHTemp
°C
Neuronal acetylcholine receptor Alpha-4/Beta-2
(Homo sapiens (Human))
BDBM50437471
(CHEMBL2409489)
Show SMILES C[C@@H]1C[C@H]1C(=O)N1CC2CNCC(C2)C1 |r|
Show InChI InChI=1S/C12H20N2O/c1-8-2-11(8)12(15)14-6-9-3-10(7-14)5-13-4-9/h8-11,13H,2-7H2,1H3/t8-,9?,10?,11-/m1/s1
NCI pathway
Reactome pathway
1n/an/an/an/an/an/an/an/a
Targacept, Inc.
Curated by ChEMBL
Assay Description
Displacement of [3H]Nicotine from alpha4beta2 nACHR in human SHEP1 cell membranes after 2 hrs by liquid scintillation counting analysis
Bioorg Med Chem Lett 23: 3927-34 (2013)
Article DOI: 10.1016/j.bmcl.2013.04.058
BindingDB Entry DOI: 10.7270/Q279462S
Neuronal acetylcholine receptor protein alpha-7 subunit
(Homo sapiens (Human))
BDBM50437471
(CHEMBL2409489)
Show SMILES C[C@@H]1C[C@H]1C(=O)N1CC2CNCC(C2)C1 |r|
Show InChI InChI=1S/C12H20N2O/c1-8-2-11(8)12(15)14-6-9-3-10(7-14)5-13-4-9/h8-11,13H,2-7H2,1H3/t8-,9?,10?,11-/m1/s1
30n/an/an/an/an/an/an/an/a
Targacept, Inc.
Curated by ChEMBL
Assay Description
Displacement of [3H]Epibatidine from human alpha7 nACHR expressed in CHO cell membranes after 2 hrs by liquid scintillation counting analysis
Bioorg Med Chem Lett 23: 3927-34 (2013)
Article DOI: 10.1016/j.bmcl.2013.04.058
BindingDB Entry DOI: 10.7270/Q279462S
Neuronal acetylcholine receptor Alpha-4/Beta-2
(Homo sapiens (Human))
BDBM50437471
(CHEMBL2409489)
Show SMILES C[C@@H]1C[C@H]1C(=O)N1CC2CNCC(C2)C1 |r|
Show InChI InChI=1S/C12H20N2O/c1-8-2-11(8)12(15)14-6-9-3-10(7-14)5-13-4-9/h8-11,13H,2-7H2,1H3/t8-,9?,10?,11-/m1/s1
NCI pathway
Reactome pathway
n/an/an/an/a 1.20E+4n/an/an/an/a
Targacept, Inc.
Curated by ChEMBL
Assay Description
Agonist activity at alpha4beta2 nACHR in human SHEP1 cell membranes assessed as stimulation of calcium flux by FLIPR assay
Bioorg Med Chem Lett 23: 3927-34 (2013)
Article DOI: 10.1016/j.bmcl.2013.04.058
BindingDB Entry DOI: 10.7270/Q279462S