null
SMILES: F[C@@H]1C[C@H]1C(=O)N1CC2CNCC(C2)C1
InChI Key: InChIKey=FAEVMLINNNVLLK-YDYPAMBWSA-N
Activity Spreadsheet -- Enzyme Inhibition Constant Data from BindingDB
Found 3 hits for monomerid = 50437491
Trg + Lig
Ki
nM
ΔG°
kcal/mole
IC50
nM
Kd
nM
EC50/IC50
nM
koff
s-1
kon
M-1s-1
pHTemp
°C
Neuronal acetylcholine receptor subunit alpha-4/beta-2
(Homo sapiens (Human))
BDBM50437491
(CHEMBL2409487)
Show SMILES F[C@@H]1C[C@H]1C(=O)N1CC2CNCC(C2)C1 |r|
Show InChI InChI=1S/C11H17FN2O/c12-10-2-9(10)11(15)14-5-7-1-8(6-14)4-13-3-7/h7-10,13H,1-6H2/t7?,8?,9-,10-/m1/s1
NCI pathway
Reactome pathway
1n/an/an/an/an/an/an/an/a
Targacept, Inc.
Curated by ChEMBL
Assay Description
Displacement of [3H]Nicotine from alpha4beta2 nACHR in human SHEP1 cell membranes after 2 hrs by liquid scintillation counting analysis
Bioorg Med Chem Lett 23: 3927-34 (2013)
Article DOI: 10.1016/j.bmcl.2013.04.058
BindingDB Entry DOI: 10.7270/Q279462S
Neuronal acetylcholine receptor subunit alpha-7
(Homo sapiens (Human))
BDBM50437491
(CHEMBL2409487)
Show SMILES F[C@@H]1C[C@H]1C(=O)N1CC2CNCC(C2)C1 |r|
Show InChI InChI=1S/C11H17FN2O/c12-10-2-9(10)11(15)14-5-7-1-8(6-14)4-13-3-7/h7-10,13H,1-6H2/t7?,8?,9-,10-/m1/s1
10n/an/an/an/an/an/an/an/a
Targacept, Inc.
Curated by ChEMBL
Assay Description
Displacement of [3H]Epibatidine from human alpha7 nACHR expressed in CHO cell membranes after 2 hrs by liquid scintillation counting analysis
Bioorg Med Chem Lett 23: 3927-34 (2013)
Article DOI: 10.1016/j.bmcl.2013.04.058
BindingDB Entry DOI: 10.7270/Q279462S
Neuronal acetylcholine receptor subunit alpha-4/beta-2
(Homo sapiens (Human))
BDBM50437491
(CHEMBL2409487)
Show SMILES F[C@@H]1C[C@H]1C(=O)N1CC2CNCC(C2)C1 |r|
Show InChI InChI=1S/C11H17FN2O/c12-10-2-9(10)11(15)14-5-7-1-8(6-14)4-13-3-7/h7-10,13H,1-6H2/t7?,8?,9-,10-/m1/s1
NCI pathway
Reactome pathway
n/an/an/an/a 430n/an/an/an/a
Targacept, Inc.
Curated by ChEMBL
Assay Description
Agonist activity at alpha4beta2 nACHR in human SHEP1 cell membranes assessed as stimulation of calcium flux by FLIPR assay
Bioorg Med Chem Lett 23: 3927-34 (2013)
Article DOI: 10.1016/j.bmcl.2013.04.058
BindingDB Entry DOI: 10.7270/Q279462S