BDBM50437833 CHEMBL2407742
SMILES: COc1ccc(NC(=O)c2ccc(CNc3nccc(n3)-c3cccnc3)cc2)c(N)c1
InChI Key: InChIKey=KFRUOFXRWUHHPE-UHFFFAOYSA-N
Data: 1 IC50
Activity Spreadsheet -- Enzyme Inhibition Constant Data from BindingDB
Found 1 hit for monomerid = 50437833
Trg + Lig
Ki
nM
ΔG°
kcal/mole
IC50
nM
Kd
nM
EC50/IC50
nM
koff
s-1
kon
M-1s-1
pHTemp
°C
Nuclear receptor corepressor 1
(Homo sapiens (Human))
BDBM50437833
(CHEMBL2407742)
Show SMILES COc1ccc(NC(=O)c2ccc(CNc3nccc(n3)-c3cccnc3)cc2)c(N)c1
Show InChI InChI=1S/C24H22N6O2/c1-32-19-8-9-22(20(25)13-19)29-23(31)17-6-4-16(5-7-17)14-28-24-27-12-10-21(30-24)18-3-2-11-26-15-18/h2-13,15H,14,25H2,1H3,(H,29,31)(H,27,28,30)
Reactome pathway
n/an/a 111n/an/an/an/an/an/a
University College London
Curated by ChEMBL
Assay Description
Inhibition of recombinant HDAC3-NCoR1 (unknown origin) using MAL as substrate incubated for 3 hrs prior to substrate addition measured after 60 mins ...
J Med Chem 56: 6156-74 (2013)
Article DOI: 10.1021/jm400634n
BindingDB Entry DOI: 10.7270/Q2N87C65