BDBM50437851 CHEMBL2407746
SMILES: O=C1Nc2ccccc2\C1=C/c1ccc2c(\C=C\c3cccnc3)n[nH]c2c1
InChI Key: InChIKey=CPIOXRCBBSICIO-SLUIUKIVSA-N
Data: 4 IC50
Activity Spreadsheet -- Enzyme Inhibition Constant Data from BindingDB
Found 4 hits for monomerid = 50437851
Trg + Lig
Ki
nM
ΔG°
kcal/mole
IC50
nM
Kd
nM
EC50/IC50
nM
koff
s-1
kon
M-1s-1
pHTemp
°C
Serine/threonine-protein kinase PLK3
(Homo sapiens (Human))
BDBM50437851
(CHEMBL2407746)
Show SMILES O=C1Nc2ccccc2\C1=C/c1ccc2c(\C=C\c3cccnc3)n[nH]c2c1
Show InChI InChI=1S/C23H16N4O/c28-23-19(17-5-1-2-6-20(17)25-23)12-16-7-9-18-21(26-27-22(18)13-16)10-8-15-4-3-11-24-14-15/h1-14H,(H,25,28)(H,26,27)/b10-8+,19-12+
NCI pathway
n/an/a>1.00E+4n/an/an/an/an/an/a
EntreMed Inc.
Curated by ChEMBL
Assay Description
Inhibition of PLK3 (unknown origin) by FRET-based homogeneous assay
J Med Chem 56: 6069-87 (2013)
Article DOI: 10.1021/jm400380m
BindingDB Entry DOI: 10.7270/Q2HM59V9
Serine/threonine-protein kinase PLK4
(Homo sapiens (Human))
BDBM50437851
(CHEMBL2407746)
Show SMILES O=C1Nc2ccccc2\C1=C/c1ccc2c(\C=C\c3cccnc3)n[nH]c2c1
Show InChI InChI=1S/C23H16N4O/c28-23-19(17-5-1-2-6-20(17)25-23)12-16-7-9-18-21(26-27-22(18)13-16)10-8-15-4-3-11-24-14-15/h1-14H,(H,25,28)(H,26,27)/b10-8+,19-12+
NCI pathway
Reactome pathway
n/an/a 2n/an/an/an/an/an/a
EntreMed Inc.
Curated by ChEMBL
Assay Description
Inhibition of N-terminal GST-tagged human PLK4 (1 to 391 amino acids) expressed in Escherichia coli using TMB as substrate after 30 mins by indirect ...
J Med Chem 56: 6069-87 (2013)
Article DOI: 10.1021/jm400380m
BindingDB Entry DOI: 10.7270/Q2HM59V9
Serine/threonine-protein kinase PLK1
(Homo sapiens (Human))
BDBM50437851
(CHEMBL2407746)
Show SMILES O=C1Nc2ccccc2\C1=C/c1ccc2c(\C=C\c3cccnc3)n[nH]c2c1
Show InChI InChI=1S/C23H16N4O/c28-23-19(17-5-1-2-6-20(17)25-23)12-16-7-9-18-21(26-27-22(18)13-16)10-8-15-4-3-11-24-14-15/h1-14H,(H,25,28)(H,26,27)/b10-8+,19-12+
NCI pathway
Reactome pathway
n/an/a>1.00E+4n/an/an/an/an/an/a
EntreMed Inc.
Curated by ChEMBL
Assay Description
Inhibition of PLK1 (unknown origin) by FRET-based homogeneous assay
J Med Chem 56: 6069-87 (2013)
Article DOI: 10.1021/jm400380m
BindingDB Entry DOI: 10.7270/Q2HM59V9
Serine/threonine-protein kinase PLK2
(Homo sapiens (Human))
BDBM50437851
(CHEMBL2407746)
Show SMILES O=C1Nc2ccccc2\C1=C/c1ccc2c(\C=C\c3cccnc3)n[nH]c2c1
Show InChI InChI=1S/C23H16N4O/c28-23-19(17-5-1-2-6-20(17)25-23)12-16-7-9-18-21(26-27-22(18)13-16)10-8-15-4-3-11-24-14-15/h1-14H,(H,25,28)(H,26,27)/b10-8+,19-12+
NCI pathway
n/an/a>1.00E+4n/an/an/an/an/an/a
EntreMed Inc.
Curated by ChEMBL
Assay Description
Inhibition of PLK2 (unknown origin) by FRET-based homogeneous assay
J Med Chem 56: 6069-87 (2013)
Article DOI: 10.1021/jm400380m
BindingDB Entry DOI: 10.7270/Q2HM59V9