BDBM50437952 CHEMBL2409118
SMILES: Fc1ccc(NC(=O)Nc2cc(CC3CC3)nn2-c2ccccc2)cc1F
InChI Key: InChIKey=JSMYZOGJVLHMQJ-UHFFFAOYSA-N
Data: 2 IC50
Activity Spreadsheet -- Enzyme Inhibition Constant Data from BindingDB
Found 2 hits for monomerid = 50437952
Trg + Lig
Ki
nM
ΔG°
kcal/mole
IC50
nM
Kd
nM
EC50/IC50
nM
koff
s-1
kon
M-1s-1
pHTemp
°C
G protein-activated inward rectifier potassium channel 4
(Homo sapiens (Human))
BDBM50437952
(CHEMBL2409118)
Show SMILES Fc1ccc(NC(=O)Nc2cc(CC3CC3)nn2-c2ccccc2)cc1F
Show InChI InChI=1S/C20H18F2N4O/c21-17-9-8-14(11-18(17)22)23-20(27)24-19-12-15(10-13-6-7-13)25-26(19)16-4-2-1-3-5-16/h1-5,8-9,11-13H,6-7,10H2,(H2,23,24,27)
Reactome pathway
n/an/a 560n/an/an/an/an/an/a
Northwest Agriculture& Forestry University
Curated by ChEMBL
Assay Description
Inhibition of GIRK1/4 (unknown origin)
Bioorg Med Chem Lett 23: 4562-6 (2013)
Article DOI: 10.1016/j.bmcl.2013.06.023
BindingDB Entry DOI: 10.7270/Q2R212SN
Kir3.1/Kir3.2
(Homo sapiens (Human))
BDBM50437952
(CHEMBL2409118)
Show SMILES Fc1ccc(NC(=O)Nc2cc(CC3CC3)nn2-c2ccccc2)cc1F
Show InChI InChI=1S/C20H18F2N4O/c21-17-9-8-14(11-18(17)22)23-20(27)24-19-12-15(10-13-6-7-13)25-26(19)16-4-2-1-3-5-16/h1-5,8-9,11-13H,6-7,10H2,(H2,23,24,27)
n/an/a 650n/an/an/an/an/an/a
Northwest Agriculture& Forestry University
Curated by ChEMBL
Assay Description
Inhibition of GIRK1/2 (unknown origin)
Bioorg Med Chem Lett 23: 4562-6 (2013)
Article DOI: 10.1016/j.bmcl.2013.06.023
BindingDB Entry DOI: 10.7270/Q2R212SN