BDBM50437984 CHEMBL2409105
SMILES: Fc1ccc(NC(=O)Nc2cc(nn2-c2ccccc2)C2CCC2)cc1Cl
InChI Key: InChIKey=FICICJIEUQQPMN-UHFFFAOYSA-N
Data: 2 IC50
Activity Spreadsheet -- Enzyme Inhibition Constant Data from BindingDB
Found 2 hits for monomerid = 50437984
Trg + Lig
Ki
nM
ΔG°
kcal/mole
IC50
nM
Kd
nM
EC50/IC50
nM
koff
s-1
kon
M-1s-1
pHTemp
°C
G protein-activated inward rectifier potassium channel 1
(Homo sapiens (Human))
BDBM50437984
(CHEMBL2409105)
Show SMILES Fc1ccc(NC(=O)Nc2cc(nn2-c2ccccc2)C2CCC2)cc1Cl
Show InChI InChI=1S/C20H18ClFN4O/c21-16-11-14(9-10-17(16)22)23-20(27)24-19-12-18(13-5-4-6-13)25-26(19)15-7-2-1-3-8-15/h1-3,7-13H,4-6H2,(H2,23,24,27)
Reactome pathway
n/an/a 1.90E+3n/an/an/an/an/an/a
Northwest Agriculture& Forestry University
Curated by ChEMBL
Assay Description
Inhibition of GIRK1/2 (unknown origin)
Bioorg Med Chem Lett 23: 4562-6 (2013)
Article DOI: 10.1016/j.bmcl.2013.06.023
BindingDB Entry DOI: 10.7270/Q2R212SN
G protein-activated inward rectifier potassium channel 4
(Homo sapiens (Human))
BDBM50437984
(CHEMBL2409105)
Show SMILES Fc1ccc(NC(=O)Nc2cc(nn2-c2ccccc2)C2CCC2)cc1Cl
Show InChI InChI=1S/C20H18ClFN4O/c21-16-11-14(9-10-17(16)22)23-20(27)24-19-12-18(13-5-4-6-13)25-26(19)15-7-2-1-3-8-15/h1-3,7-13H,4-6H2,(H2,23,24,27)
Reactome pathway
n/an/a 610n/an/an/an/an/an/a
Northwest Agriculture& Forestry University
Curated by ChEMBL
Assay Description
Inhibition of GIRK1/4 (unknown origin)
Bioorg Med Chem Lett 23: 4562-6 (2013)
Article DOI: 10.1016/j.bmcl.2013.06.023
BindingDB Entry DOI: 10.7270/Q2R212SN