BDBM50437985 CHEMBL2409104
SMILES: Brc1cccc(NC(=O)Nc2cc(nn2-c2ccccc2)C2CCC2)c1
InChI Key: InChIKey=WMKOFHYQCJBOLA-UHFFFAOYSA-N
Data: 2 IC50
Activity Spreadsheet -- Enzyme Inhibition Constant Data from BindingDB
Found 2 hits for monomerid = 50437985
Trg + Lig
Ki
nM
ΔG°
kcal/mole
IC50
nM
Kd
nM
EC50/IC50
nM
koff
s-1
kon
M-1s-1
pHTemp
°C
G protein-activated inward rectifier potassium channel 1
(Homo sapiens (Human))
BDBM50437985
(CHEMBL2409104)
Show SMILES Brc1cccc(NC(=O)Nc2cc(nn2-c2ccccc2)C2CCC2)c1
Show InChI InChI=1S/C20H19BrN4O/c21-15-8-5-9-16(12-15)22-20(26)23-19-13-18(14-6-4-7-14)24-25(19)17-10-2-1-3-11-17/h1-3,5,8-14H,4,6-7H2,(H2,22,23,26)
Reactome pathway
n/an/a 1.90E+3n/an/an/an/an/an/a
Northwest Agriculture& Forestry University
Curated by ChEMBL
Assay Description
Inhibition of GIRK1/2 (unknown origin)
Bioorg Med Chem Lett 23: 4562-6 (2013)
Article DOI: 10.1016/j.bmcl.2013.06.023
BindingDB Entry DOI: 10.7270/Q2R212SN
G protein-activated inward rectifier potassium channel 4
(Homo sapiens (Human))
BDBM50437985
(CHEMBL2409104)
Show SMILES Brc1cccc(NC(=O)Nc2cc(nn2-c2ccccc2)C2CCC2)c1
Show InChI InChI=1S/C20H19BrN4O/c21-15-8-5-9-16(12-15)22-20(26)23-19-13-18(14-6-4-7-14)24-25(19)17-10-2-1-3-11-17/h1-3,5,8-14H,4,6-7H2,(H2,22,23,26)
Reactome pathway
n/an/a 720n/an/an/an/an/an/a
Northwest Agriculture& Forestry University
Curated by ChEMBL
Assay Description
Inhibition of GIRK1/4 (unknown origin)
Bioorg Med Chem Lett 23: 4562-6 (2013)
Article DOI: 10.1016/j.bmcl.2013.06.023
BindingDB Entry DOI: 10.7270/Q2R212SN