BDBM50437990 CHEMBL2409099
SMILES: Fc1ccc(NC(=O)Nc2cc(CC3CC3)nn2-c2ccccc2)cc1
InChI Key: InChIKey=FSXVXGIXJHYALR-UHFFFAOYSA-N
Data: 2 IC50
Activity Spreadsheet -- Enzyme Inhibition Constant Data from BindingDB
Found 2 hits for monomerid = 50437990
Trg + Lig
Ki
nM
ΔG°
kcal/mole
IC50
nM
Kd
nM
EC50/IC50
nM
koff
s-1
kon
M-1s-1
pHTemp
°C
G protein-activated inward rectifier potassium channel 1
(Homo sapiens (Human))
BDBM50437990
(CHEMBL2409099)
Show SMILES Fc1ccc(NC(=O)Nc2cc(CC3CC3)nn2-c2ccccc2)cc1
Show InChI InChI=1S/C20H19FN4O/c21-15-8-10-16(11-9-15)22-20(26)23-19-13-17(12-14-6-7-14)24-25(19)18-4-2-1-3-5-18/h1-5,8-11,13-14H,6-7,12H2,(H2,22,23,26)
Reactome pathway
n/an/a 640n/an/an/an/an/an/a
Northwest Agriculture& Forestry University
Curated by ChEMBL
Assay Description
Inhibition of GIRK1/2 (unknown origin)
Bioorg Med Chem Lett 23: 4562-6 (2013)
Article DOI: 10.1016/j.bmcl.2013.06.023
BindingDB Entry DOI: 10.7270/Q2R212SN
G protein-activated inward rectifier potassium channel 4
(Homo sapiens (Human))
BDBM50437990
(CHEMBL2409099)
Show SMILES Fc1ccc(NC(=O)Nc2cc(CC3CC3)nn2-c2ccccc2)cc1
Show InChI InChI=1S/C20H19FN4O/c21-15-8-10-16(11-9-15)22-20(26)23-19-13-17(12-14-6-7-14)24-25(19)18-4-2-1-3-5-18/h1-5,8-11,13-14H,6-7,12H2,(H2,22,23,26)
Reactome pathway
n/an/a 270n/an/an/an/an/an/a
Northwest Agriculture& Forestry University
Curated by ChEMBL
Assay Description
Inhibition of GIRK1/4 (unknown origin)
Bioorg Med Chem Lett 23: 4562-6 (2013)
Article DOI: 10.1016/j.bmcl.2013.06.023
BindingDB Entry DOI: 10.7270/Q2R212SN