BDBM50438153 CHEMBL2409861
SMILES: OC[C@H]1C[C@@H](O)CCN1CCc1ccc(Nc2nc(cs2)-c2ccc3ccccc3c2)cc1
InChI Key: InChIKey=ACZJGLPLAZYYDS-RPBOFIJWSA-N
Data: 2 IC50
Activity Spreadsheet -- Enzyme Inhibition Constant Data from BindingDB
Found 2 hits for monomerid = 50438153
Trg + Lig
Ki
nM
ΔG°
kcal/mole
IC50
nM
Kd
nM
EC50/IC50
nM
koff
s-1
kon
M-1s-1
pHTemp
°C
Sphingosine kinase 1 (SPHK1)
(Homo sapiens (Human))
BDBM50438153
(CHEMBL2409861)
Show SMILES OC[C@H]1C[C@@H](O)CCN1CCc1ccc(Nc2nc(cs2)-c2ccc3ccccc3c2)cc1 |r|
Show InChI InChI=1S/C27H29N3O2S/c31-17-24-16-25(32)12-14-30(24)13-11-19-5-9-23(10-6-19)28-27-29-26(18-33-27)22-8-7-20-3-1-2-4-21(20)15-22/h1-10,15,18,24-25,31-32H,11-14,16-17H2,(H,28,29)/t24-,25+/m1/s1
n/an/a 20n/an/an/an/an/an/a
Amgen Inc.
Curated by ChEMBL
Assay Description
Inhibition of purified human SphK1 assessed as inhibition of formation of [33P]-S1P after 50 mins by scintillation counting
Bioorg Med Chem Lett 23: 4608-16 (2013)
Article DOI: 10.1016/j.bmcl.2013.06.030
BindingDB Entry DOI: 10.7270/Q2736SB3
Sphingosine kinase types 2 (SphK2)
(Homo sapiens (Human))
BDBM50438153
(CHEMBL2409861)
Show SMILES OC[C@H]1C[C@@H](O)CCN1CCc1ccc(Nc2nc(cs2)-c2ccc3ccccc3c2)cc1 |r|
Show InChI InChI=1S/C27H29N3O2S/c31-17-24-16-25(32)12-14-30(24)13-11-19-5-9-23(10-6-19)28-27-29-26(18-33-27)22-8-7-20-3-1-2-4-21(20)15-22/h1-10,15,18,24-25,31-32H,11-14,16-17H2,(H,28,29)/t24-,25+/m1/s1
n/an/a 760n/an/an/an/an/an/a
Amgen Inc.
Curated by ChEMBL
Assay Description
Inhibition of purified human SphK2 assessed as inhibition of formation of [33P]-S1P after 50 mins by scintillation counting
Bioorg Med Chem Lett 23: 4608-16 (2013)
Article DOI: 10.1016/j.bmcl.2013.06.030
BindingDB Entry DOI: 10.7270/Q2736SB3